{"text_format":"1","workbook":"xlsx","n_sheets":11,"sheets":["Reference Only","Doc tracking sheet","Risks","Actions","Issues","Decisions","Lessons learned","Instructions >","EMV","Lists","Calculations"],"not_rendered":{"charts":0,"images":2,"macros":1,"external_links":1,"defined_names":55,"comments":0,"pivot_tables":0},"unopened":[],"bounds":{"document_bytes":16777216,"sheet_cells":100000,"rows_first":2000,"rows_last":500,"rows_between":2000,"halvings":0,"cell_chars":16384,"cell_head_chars":4096},"cells_cut":0,"cells_raw":0,"read":"whole","date_system":"1900"}

{"sheet":"Reference Only","index":0,"n_rows":50,"n_cols":20,"rows_kept":50,"cut":false,"hidden":true,"merged":[[43,2,44,3],[45,2,49,2],[3,3,3,7],[3,18,8,18],[3,19,8,19],[5,1,9,1],[9,18,16,18],[9,19,16,19],[17,18,26,18],[17,19,26,19]]}
[]
[null,"Risk assessment",null,null,null,null,null,null,null,null,null,"Workstream ID"]
[null,null,null,null,null,null,null,null,null,null,null,null,null,null,null,null,null,null,"Risk"]
[null,null,null,"Consequence",null,null,null,null,null,null,null,"Risk Strategy","PRINCE2 Definition","Guidance",null,null,null,null,"A – Material at Board and SPMC level","•A breach of state or federal regulatory compliance obligations\n•Direct and imminent negative patient care outcomes\n•Direct and imminent negative workplace health and safety outcomes  \n•A breach of contractual obligations by suppliers\n•A breach of contractual obligations by SC HHS \n•Damage to HHS reputation at state or federal level\n•A significant variance to Board authorised PDU program scope, budget, deliverables, quality or benefits\n•A significant variance to SPMC authorised portfolio scope, budget, deliverables, quality or benefits\n•A material impact on cross portfolio dependencies."]
[null,null,null,"Negligible","Minor","Moderate","Major","Extreme",null,null,null,"Avoid","Typically involves changing some aspect of the project, i.e. the scope, procurement route, supplier or sequence of activities, so that the threat either can no longer have an impact or can no longer happen.","Avoid either happening or having an impact if it does."]
[null,"Likelihood","Almost Certain","Medium (7)","Medium (11)","High (17)","Very High (23)","Very High (25)",null,null,null,"Reduce","Proactive actions taken to:\n- Reduce the probability of the event occurring, by performing some form of control.\n- Reduce the impact of the event should it occur.","Reduce either happening or having an impact if it does."]
[null,null,"Likely","Medium (6)","Medium (10)","High (16)","High (20)","Very High (24)",null,null,null,"Fallback","Putting in place a fallback plan for the actions that will be taken to reduce the impact of the threat should the risk occur. This ia a reactive form of the 'reduce' response which has no impact on likelihood.","Reduce impact only"]
[null,null,"Possible","Low (3)","Medium (9)","High (15)","High (18)","High (22)",null,null,null,"Transfer","A third party takes on responsibility for some of the financial impact of the threat. E.g. through insurance or by means of appropriate clauses in a contract. This is a form of the 'reduce' response which only reduces the financial impact of the threat.","Typically with insurance, reduces financial impact only"]
[null,null,"Unlikely","Low (2)","Medium (8)","Medium (12)","Medium (14)","High (21)",null,null,null,"Accept","A conscious and delibrate decision is taken to retain the threat, having discerned that it is more econimical to do so than to attempt a threat response action. The threat should continue to be monitored to ensure that it remains tolerable.","Accept (tolerate)"]
[null,null,"Rare","Low (1)","Low (4)","Low (5)","Medium (13)","High (19)",null,null,null,"Share","Modern procurement methods commonly entail a form of risk sharing through the application of a pain/gain formula: noth parties share the gain (within pre-agreed limits) if the cost is less than the cost plan","Share (typically with another partner, eg PPP)",null,null,null,null,"B – Material at Portfolio/Program level","•Can still be managed within SPMC approved tolerances, and/or\n•Will not have an impct on cross portfolio dependencies"]
{"$rows_left_out":41}
{"sheet":"Doc tracking sheet","index":1,"n_rows":2,"n_cols":15,"rows_kept":2,"cut":false,"hidden":false,"merged":[[0,1,0,14]]}
[null,"Project documentation - Tracking Sheet"]
["Document Number","Date Received","Document Type","From","Description","Who Sent to and Action Required","Returned","Who Sent to and Action Required","Returned","Who Sent to and Action Required","Returned","Who sent to and Action required","Returned","Actions Taken","Date"]

{"sheet":"Risks","index":2,"n_rows":10,"n_cols":21,"rows_kept":10,"cut":false,"hidden":false,"merged":[[8,16,8,19],[8,8,8,15],[8,0,8,7],[0,9,0,12],[1,9,1,10],[5,11,5,12],[0,6,0,7],[3,9,3,10],[4,9,4,10]]}
["Project Name"," ","Project Abbreviation:",null,null,"Mini Dashboard","FOR REVIEW",null,null,"Your Personal Dashboard"]
["Risk register",null,null,null,null,{"$f":"((COUNTIFS(A:A,\"R*\",D:D,\"<>closed\"))-2)&\" Current Open Risks\"","v":"0 Current Open Risks"},"For Review:",{"$f":"COUNTIFS(A:A,\"R*\",#REF!,\"*e*\")-1","v":{"$error":"#REF!"}},null,"Select Responsible Officer",null,null,{"$f":"((COUNTIFS(O:O,VLOOKUP(Lists!$C$2,Lists!A:B,2,0),A:A,\"R*\",D:D,\"<>closed\")))&\" Current Open Risks\"","v":"0 Current Open Risks"}]
["Last reviewed by:",null,null,null,null,{"$f":"\"Of which \"&(COUNTIFS(A:A,\"R*\",D:D,\"<>closed\",G:G,\"Project risk\"))&\" are risks to the project,  \"&(COUNTIFS(A:A,\"R*\",D:D,\"<>closed\",G:G,\"BAU operational risk\"))&\" BAU operations and \"&(COUNTIFS(A:A,\"R*\",D:D,\"<>closed\",G:G,\"Risk to both*\"))&\" could impact both.\"","v":"Of which 0 are risks to the project,  0 BAU operations and 0 could impact both."},"New Risks:",{"$f":"((COUNTIFS(A:A,\"R*\",D:D,\"<>Closed\",D:D,\"New\")))","v":0},null,null,null,null,{"$f":"((COUNTIFS(O:O,VLOOKUP(Lists!$C$2,Lists!A:B,2,0),S:S,\"Very*\",D:D,\"<>closed\")))&\" Risk Residual of Very High\"","v":"0 Risk Residual of Very High"}]
["Last reviewed:",null,null,null,null,{"$f":"(COUNTIFS(A:A,\"R*\",D:D,\"<>Closed\",#REF!,\"Board*\"))&\" Risk escalating to the PMO Monthly report\"","v":{"$error":"#REF!"}},"Escalating A's:",{"$f":"COUNTIFS(A:A,\"R*\",#REF!,\"*Critical*\")","v":{"$error":"#REF!"}},null,"Review Required:",null,{"$f":"COUNTIFS(O:O,VLOOKUP(Lists!$C$2,Lists!A:B,2,0),A:A,\"R*\",#REF!,\"*e*\")","v":{"$error":"#REF!"}},{"$f":"((COUNTIFS(O:O,VLOOKUP(Lists!$C$2,Lists!A:B,2,0),S:S,\"High*\",D:D,\"<>closed\")))&\" Risk Residual of High\"","v":"0 Risk Residual of High"}]
[null,null,null,null,null,{"$f":"((COUNTIFS(S:S,\"Very*\",D:D,\"<>closed\")))&\" Risk Residual of Very High\"","v":"0 Risk Residual of Very High"},"Escalating B's:",{"$f":"COUNTIFS(A:A,\"R*\",#REF!,\"Board Report\")","v":{"$error":"#REF!"}},null,"New:",null,{"$f":"COUNTIFS(O:O,VLOOKUP(Lists!$C$2,Lists!A:B,2,0),A:A,\"R*\",D:D,\"New\")","v":0},{"$f":"((COUNTIFS(O:O,VLOOKUP(Lists!$C$2,Lists!A:B,2,0),A:A,\"R*\",D:D,\"<>Closed\",#REF!,\"Board*\")))&\" are flagged to escalated to the board\"","v":{"$error":"#REF!"}}]
[]
["Details/ Comment for each field in the table hidden in row 8.",null,null,null,null,null,null,null,null,null,"FORMULA COLUMN",null,null,null,null,null,null,null,"FORMULA COLUMN"]
["<refer to \"RAID ID\" tab>","<date>","<name, position>","New\nUnder Investigation\nTreating\nEscalated\nRealised\nClosed\n",null,"“There is a risk that... <identify a risk that may have an impact on the objectives of your program/project>... which may be caused by…<Identify the possible cause of the risk and the factors that may contribute to the risk being realised>... the consequences of which are <identify the consequence>...and the likelihood of this occurring is <identify the likelihood>”. The overall risk rating is <identify the overall risk rating>.   \n\n",null,"A – Material at Board and SPMC level\nB – Material at Portfolio/Program level\nC – Material at Project level","Negligible\nMinor\nModerate\nMajor\nExtreme\n","Almost Certain\nLikely\nPossible\nUnlikely\nRare","=IFERROR(IF(M11=\"-\",\"Unassessed\",VLOOKUP($M11,Assess,(HLOOKUP($L11,Conseq,7,0)),0)),\"Not yet rated\")","Accept\nAvoid\nFall-back\nReduce\nTBD","1. mitigation activity\n2. mitigation activity\n3. mitigation activity","Comments about the risk or mitigation progress here. ","<position>","<position>","Negligible\nMinor\nModerate\nMajor\nExtreme","Almost Certain\nLikely\nPossible\nUnlikely\nRare\n-","=IFERROR(IF(U11=\"-\",\"Unassessed\",VLOOKUP($U11,Assess,(HLOOKUP($T11,Conseq,7,0)),0)),\"Not yet Rated\")","Up\nDown\nStable"]
["Identification",null,null,null,null,null,null,null,"Assessment",null,null,null,null,null,null,null,"Residual"]
["Risk ID ","Date raised","Raised by","Status","Date closed","Risk description (please include a risk title is bold letters)","Risk impact type","Context","Inherent consequence","Inherent likelihood","Inherent overall risk rating ","Risk strategy (mitigation)","Mitigation","Comments","Risk Responsible Officer","Risk Accountable Owner","Residual consequence","Residual likelihood","Residual overall risk","Trending","Trending Commentary"]
{"$rows_left_out":1}
{"sheet":"Actions","index":3,"n_rows":89,"n_cols":9,"rows_kept":89,"cut":false,"hidden":false,"merged":[]}
["Project Name","Frail Older Persons Collaborative","Project Abbreviation: FOP"," ",null,null,"Key for Action ID","REC - recruitment\nPRO - procurement\nFOP - PMO plus Steering Committee\nGRWG - Gedi Rass Working Group\nEWEWG - EWE Working Group"]
["Action register",null,null,null,null,null,"Key for Source ID","EPMO\nPO - project officer\nWG - Working Group"]
["Last reviewed by:","Karlene Morgan"]
["Last reviewed:","2019-06-21T08:18:18"]
["Current Phase:"]
["NOTE: It is a project requirement to record actions. If the project decides to use this action register to track key actions. If the decision is to use an alternate tool/system (e.g.  meeting minutes) it is important that all actions are tracked to completion and are kept as a record. "]
[]
["Action ID","Source","Action description","Project / Program","Action owner","Comments","Status","Target Completion","Date closed"]
[]
["A-FOP-001","PMO/SC","Present steering committee Terms of Reference (TOR) for endorsement ","FOP","Melanie Strachan/Karlene","Steering Committee members agreed to revised TOR\n19/6/19 Sent to Luke Worth for authorisation\n5/8/19 resent to Luke Worth for authorisation\n22/8 Implementation TOR document sent to Luke Worth for endorsement.  F/Up has occurred with MSG Corro Officer\n27/8 Endorsed document received. Sent to Jess Waldon.","Complete","2019-08-16","2018-08-27"]
{"$rows_left_out":80}
{"sheet":"Issues","index":4,"n_rows":42,"n_cols":21,"rows_kept":42,"cut":false,"hidden":false,"merged":[[6,0,6,9],[6,17,6,19],[0,8,0,9],[5,15,5,16],[6,10,6,16]]}
["Project Name:"," ",null,null,null,null,null,"Mini Dashboard","FOR REVIEW",null,null,null,null,"Your Personal Dashboard"]
["Issues register",null,null,null,null,null,null,{"$f":"((COUNTIFS(A:A,\"I*\",E:E,\"<>closed\"))-2)&\" Current Open Issues\"","v":"34 Current Open Issues"},"For Review:",{"$f":"COUNTIFS(A:A,\"I*\",S:S,\"*e*\")-1","v":0},null,null,null,"Select Responsible Officer",{"$f":"((COUNTIFS(P:P,VLOOKUP(Lists!$C$2,Lists!A:B,2,0),A:A,\"I*\",E:E,\"<>closed\")))&\" Current Open Issues\"","v":"0 Current Open Issues"}]
["Last reviewed by:",null,"Karlene Morgan",null,null,null,null,{"$f":"\"Of which \"&(COUNTIFS(A:A,\"I*\",E:E,\"<>closed\",I:I,\"Project issue\"))&\" are issues with the project,  \"&(COUNTIFS(A:A,\"I*\",E:E,\"<>closed\",I:I,\"BAU operational issue\"))&\" BAU operations and \"&(COUNTIFS(A:A,\"I*\",E:E,\"<>closed\",I:I,\"Issue to both*\"))&\" could impact both.\"","v":"Of which 0 are issues with the project,  0 BAU operations and 0 could impact both."},"New Issues:",{"$f":"((COUNTIFS(A:A,\"i*\",E:E,\"<>Closed\",E:E,\"New\")))","v":2},null,null,null,null,{"$f":"((COUNTIFS(P:P,VLOOKUP(Lists!$C$2,Lists!A:B,2,0),M:M,\"Very*\",E:E,\"<>closed\")))&\" Issues rated Very High\"","v":"0 Issues rated Very High"}]
["Last reviewed:",null,"2019-08-22T13:19:36",null,null,null,null,{"$f":"(COUNTIFS(A:A,\"I*\",E:E,\"<>Closed\",T:T,\"Board*\"))&\" Issues escalating to the PMO monthly report\"","v":"0 Issues escalating to the PMO monthly report"},"Escalating A's:",{"$f":"COUNTIFS(A:A,\"i*\",T:T,\"*Critical*\")","v":0},null,null,null,{"$f":"\"Review Required: \"&COUNTIFS(P:P,VLOOKUP(Lists!$C$2,Lists!A:B,2,0),A:A,\"I*\",R:R,\"*e*\")","v":"Review Required: 0"},{"$f":"((COUNTIFS(P:P,VLOOKUP(Lists!$C$2,Lists!A:B,2,0),M:M,\"High*\",E:E,\"<>closed\")))&\" Issue rating of High\"","v":"0 Issue rating of High"}]
["Current Phase:",null,null,null,null,null,null,{"$f":"((COUNTIFS(M:M,\"Very*\",E:E,\"<>closed\")))&\" Issue rating of Very High\"","v":"0 Issue rating of Very High"},"Escalating B's:",{"$f":"COUNTIFS(A:A,\"i*\",T:T,\"Board Report\")","v":0},null,null,null,{"$f":"\"Escalating: \"&COUNTIFS(P:P,VLOOKUP(Lists!$C$2,Lists!A:B,2,0),A:A,\"I*\",E:E,\"New\")","v":"Escalating: 0"},{"$f":"((COUNTIFS(P:P,VLOOKUP(Lists!$C$2,Lists!A:B,2,0),A:A,\"I*\",E:E,\"<>Closed\",T:T,\"Board*\")))&\" are flagged to escalated to the board\"","v":"0 are flagged to escalated to the board"}]
[null,null,null,null,null,null,null,null,null,null,null,null,"FORMULA COLUMN",null,null,null,null,null,"FORMULA COLUMN","FORMULA COLUMN","FORMULA COLUMN"]
["Identification",null,null,null,null,null,null,null,null,null,"Assessment",null,null,null,null,null,null,"Review"]
["Issue ID ","Date raised","Raised by","Project / Program","Status","Date closed","Related Risk ID","Issue description","Issue impact type","Context","Issue Urgency","Issue Impact","Overall Issue Rating","Current Resolution/action plan","Comments","Issue Responsible Officer","Issue Accountable Owner","NEXT Review Date","Requires Review","Escalated"]
[" "]
["I-FOP-001","2019-06-10","RaSS / GEDI Implementation Working Group","FOPC","Managing","2019-06-27"]
{"$rows_left_out":33}
{"sheet":"Decisions","index":5,"n_rows":8,"n_cols":9,"rows_kept":8,"cut":false,"hidden":false,"merged":[]}
["Project Name"," ","Project Abbreviation:"," "]
["Decisions register"]
["Last reviewed by:"]
["Last reviewed:"]
["Current Phase:"]
["NOTE: It is a project requirement to record and track key project decisions. It is the decision of the Portfolio, Program or Project to use this decisions register to track key decisions. If the decision is to use an alternate tool/system (e.g.  meeting minutes) it is important that all decisions are tracked and are kept as a record. "]
[]
["Decision ID","Source","Decision description","Owner","Project / Program","Decision maker","Status","Date approved/rejected","Comments"]

{"sheet":"Lessons learned","index":6,"n_rows":7,"n_cols":12,"rows_kept":7,"cut":false,"hidden":false,"merged":[]}
["Project name"," ","Project Abbreviation:"," "]
["Lessons learned register"]
["Last reviewed by:"]
["Last reviewed:"]
[]
[]
["Lesson ID","Date","Raised by","Identified by (change request number)","Project / Program","Lesson Description\n(Describe the experience)","Rating\n(Positive or Negative)","The impact \n(High, medium, low)","Category\n(People, process, tools)","Sub-Category","Lesson outcome\n(How the experience affected the project)","The recommendation\n(Advice for future projects)"]

{"sheet":"Instructions >","index":7,"n_rows":37,"n_cols":9,"rows_kept":37,"cut":false,"hidden":false,"merged":[[2,0,2,8],[4,0,4,8],[14,4,14,5],[14,0,14,1],[14,7,14,8],[29,4,29,5],[31,0,31,1],[24,0,24,8],[26,4,26,5],[27,4,27,5],[28,4,28,5],[25,4,25,5]]}
["Instructions"]
[]
["Risks, Actions, Issues, Decisions, Lessons learned and Benefits register (RAIDL B)\nRisks and Issues - Click the below like for the PMO risks and issues process\nDecisions - Click the below link for the PMO Change Control Process\nLessons learnt - Click the below click for PMO lessons learnt process and workshop guide\nBenefits - Click the below link for the PMO Benefits realisation strategy and benefits realisation plan template"]
[]
["RISKS"]
["Risk Strategy","PRINCE2 Definition","Guidance",null,"Risk Status","Definition",null,"Risk Context","Definition"]
["Avoid","Typically involves changing some aspect of the project, i.e. the scope, procurement route, supplier or sequence of activities, so that the threat either can no longer have an impact or can no longer happen.","Avoid either happening or having an impact if it does.",null,"New","A new threat has been identified that may have an impact on the objectives of your program or project. The assessment process is yet to occur.  ",null,"A - Material at Board or Board Sub-Committee level","•A breach of state or federal regulatory compliance obligations\n•Direct and imminent negative patient care outcomes\n•Direct and imminent negative workplace health and safety outcomes  \n•A breach of contractual obligations by suppliers.\n•A breach of contractual obligations by SCHHS \n•Damage to HHS reputation at state or federal level\n•A material  variance to  authorised scope, budget, deliverables, quality or benefits of a strategic SCHHS project \n•A material impact on cross project dependencies."]
["Reduce","Proactive actions taken to:\n- Reduce the probability of the event occurring, by performing some form of control.\n- Reduce the impact of the event should it occur.","Reduce either happening or having an impact if it does.",null,"Under Investigation","The possible cause of the risk and the factors that may contribute to the risk being realised are currently being determined. ",null,"B - Material at Portfolio or Executive Sponsor level","•Can still be managed within  approved tolerances, and/or\n•Will not have an impact on cross project dependencies"]
["Transfer","A third party takes on responsibility for some of the financial impact of the threat. E.g. through insurance or by means of appropriate clauses in a contract. This is a form of the 'reduce' response which only reduces the financial impact of the threat.","Typically with insurance, reduces financial impact only.",null,"Treating","A risk mitigation plan is in place. ",null,"C - Material at Program/Project level","•Lead to a breach of approved tolerances, or\n•Have a detrimental impact on cross project dependencies"]
["Accept","A conscious and deliberate decision is taken to retain the threat, having discerned that it is more economical to do so than to attempt a threat response action. The threat should continue to be monitored to ensure that it remains tolerable.","Accept (tolerate).",null,"Escalated","The risk has been escalated to the relevant delegate"]
{"$rows_left_out":28}
{"sheet":"EMV","index":8,"n_rows":15,"n_cols":2,"rows_kept":15,"cut":false,"hidden":true,"merged":[[14,0,14,5]]}
["Expected Monetary Value - formula"]
[]
["1.     Based on the likelihood rating, assign a probability of occurrence for the risk."]
[]
["Risk Likelihood Rating","Probability %"]
["Almost Certain",0.9]
["Likely",0.7]
["Possible",0.5]
["Unlikely",0.3]
["Rare",0.1]
{"$rows_left_out":6}
{"sheet":"Lists","index":9,"n_rows":11,"n_cols":3,"rows_kept":11,"cut":false,"hidden":true,"merged":[[9,0,9,2]]}
[null,"RESPONSIBLE OFFICER"]
[1,"1. Executive Sponsor - ",1]
[2,"2. Clinical Sponsor "]
[3,"3. Steering Committee"]
[4,"4. Project Team"]
[5]
[6]
[7]
[8]
["ADDING MORE THAN 8 REQUIRES UPDATING THE NAME MANAGER IN THE FORUMLAS TAB"]
{"$rows_left_out":2}
{"sheet":"Calculations","index":10,"n_rows":63,"n_cols":10,"rows_kept":63,"cut":false,"hidden":true,"merged":[[0,0,0,9],[32,5,32,9],[23,1,27,1],[21,3,21,7],[21,1,21,2],[20,1,20,9],[10,1,10,9],[3,1,7,1],[1,3,1,7],[1,1,1,2],[11,3,11,7],[13,1,17,1],[11,1,11,2]]}
["RISKS"]
["Risk Strategy","Risk Rating Matrix",null,"Consequence",null,null,null,null,"Trending","Risk Status"]
["Avoid",null,null,"Negligible","Minor","Moderate","Major","Extreme","Up","New"]
["Reduce","Likelihood","Almost Certain","Medium (7)","Medium (11)","High (17)","Very High (23)","Very High (25)","Down","Under Investigation"]
["Transfer",null,"Likely","Medium (6)","Medium (10)","High (16)","High (20)","Very High (24)","Stable","Treating"]
["Accept",null,"Possible","Low (3)","Medium (9)","High (15)","High (18)","High (22)","Impact type","Escalated"]
["Share",null,"Unlikely","Low (2)","Medium (8)","Medium (12)","Medium (14)","High (21)","Project risk","Realised"]
["TBD",null,"Rare","Low (1)","Low (4)","Low (5)","Medium (13)","High (19)","BAU operational risk","Closed"]
[null,null,"Hlookup",2,3,4,5,6,"Risk to both the project and BAU Operations"," "]
[]
{"$rows_left_out":53}