{"text_format":"1","workbook":"xlsx","n_sheets":9,"sheets":["Dashboard","Specifications","Status_panel","funnelPivot","getfunneldata","barPivot","Data","Funnel_practice","Graphics1"],"not_rendered":{"charts":4,"images":5,"macros":1,"external_links":1,"defined_names":31,"comments":0,"pivot_tables":3},"unopened":[{"sheet":"Funnel_practice","index":7,"reason":"not_a_worksheet"}],"bounds":{"document_bytes":16777216,"sheet_cells":100000,"rows_first":2000,"rows_last":500,"rows_between":2000,"halvings":0,"cell_chars":16384,"cell_head_chars":4096},"cells_cut":0,"cells_raw":0,"read":"whole","date_system":"1900"}

{"sheet":"Dashboard","index":0,"n_rows":23,"n_cols":19,"rows_kept":23,"cut":false,"hidden":false,"merged":[[5,13,7,16],[10,13,12,16]]}
[null,"Selected National Core Maternity Indicators"]
[null,{"$f":"Status_panel!B23","v":"Caesarean section for selected females giving birth for the first time"}]
[null,{"$f":"Status_panel!B24","v":"Peer group level 6 public acute hospitals, Queensland, 2018 and 2019"}]
[null,null,null,null,null,null,null,null,null,null,null,null,null,null,null,null,null,null,{"$f":"funnelPivot!B2","v":"Level 6"}]
[]
[null,null,null,null,null,null,null,null,null,null,null,null,null,{"$f":"numerator","v":"The number of selected females giving birth for the first time who gave birth by caesarean section."}]
[]
[]
[]
[null,null,null,null,null,null,"Funnel plot for Peer group 1"]
[null,null,null,null,null,null,null,null,null,null,null,null,null,{"$f":"VLOOKUP(funnelPivot!B3, getfunneldata!L2:N8, 3, FALSE)","v":"All selected females."}]
[]
[]
[]
[]
[]
[]
[]
[null,null,null,null,null,null,null,null,null,null,null,null,null,null," Numerator "," Denominator","Proportion (%)"]
[null,null,null,null,null,null,null,null,null,null,null,null,null,"Gold Coast University Hospital",769,3208,23.971321696]
[null,null,null,null,null,null,null,null,null,null,null,null,null,"Mater Mothers' Hospital",937,3711,25.249258959999999]
[null,null,null,null,null,null,"Bar chart of above data",null,null,null,null,null,null,"Royal Brisbane and Women's",897,2988,30.020080320999998]
[null,null,null,null,null,null,null,null,null,null,null,null,null,"Townsville",344,1232,27.922077922]

{"sheet":"Specifications","index":1,"n_rows":52,"n_cols":10,"rows_kept":52,"cut":false,"hidden":false,"merged":[]}
[]
[null,"Indicator specifications"]
[]
[]
[null,"Data source"]
[]
[null,"Queensland Perinatal Data Collection, Statistical Services Branch, Queensland Department of Health"]
[null,"Extracted on: ",null,"2022-05-17"]
[]
[null,"Notes"]
[]
[null,"Funnel plots present treatment estimates (e.g. rate of induction)  for each facility against the relevant number of mothers overall at the facility (e.g. all women, selected primigravida)."]
[null,"Control limits (95% and 99.7%)  represent the upper and lower bounds of normal variation around the overall peer group rate."]
[null,"Indicator results that are based on denominator<5, numerator=0 or numerator=denominator (i.e. rate of 100%) are not presented."]
[null,"Facility/peer group is based on the facility of birth."]
[null,"Peer group determined based on Clinical Services Capability Framework."]
[null,"Some hospitals changed peer group level over the time period:"]
[null,"Redland changed from CSCF level 3 to level 4 on June 1, 2016."]
[null,"Beaudesert changed from CSCF level 1 to level 3 on June 1, 2016."]
[null,"Chinchilla changed from CSCF level 1 to level 2 on November 1, 2014."]
[null,"Theodore changed from CSCF level 2 to level 1 on July 4, 2017."]
[null,"Charters Towers changed from CSCF level 2 to level 1 on November 1, 2014."]
[null,"Ingham changed from CSCF level 1 to level 3 on September 22, 2016."]
[null,"Cooktown changed from CSCF level 1 to level 3 on May 12, 2017."]
[null,"Tully changed from CSCF level 2 to level 1 on March 16, 2017."]
[null,"Mount Isa changed from CSCF level 4 to level 3 on September 1, 2015."]
[null,"In these cases, the hospital appears for each relevant peer group, based on births from the relevant time period."]
[null,"Birthing centres are combined with parent facility."]
[null,"Data for private facilities across Queensland are only presented in aggregate."]
[null,"For multiple births, women are categorised by the birth method of the first baby."]
[null,"Includes women giving birth in facility and inborn babies only. Home births, babies born before arrival and births at unknown facility are excluded."]
[null,"Each indicator excludes records where data elements (relevant to that indicator) are missing, not stated or not interpretable. "]
[null,"If a record did not contain sufficient information to determine its eligibility for the numerator (e.g. due to incomplete data), the record was also removed from the denominator."]
[]
[null,"Indicator Definitions"]
[]
[null,"Indicator Set: National Core Maternity Indicators, 2021"]
[null,"Induction of labour for selected females giving birth for the first time",null,null,null,null,null,null,null,"(\"Selected females\" criteria relaxed for \"all females\" version of indicator)."]
[null,"Caesarean section for selected females giving birth for the first time",null,null,null,null,null,null,null,"(\"Selected females\" criteria relaxed for \"all females\" version of indicator)."]
[null,"Non-instrumental vaginal birth for selected females giving birth for the first time"]
[null,"Females having their second birth vaginally whose first birth was by caesarean section"]
[]
[null,"Related"]
[]
[null,"Queensland Mothers and Babies 2014 and 2015: Report of the Queensland Maternal and Perinatal Quality Council 2017"]
[null,"Queensland Mothers and Babies 2016 and 2017: Report of the Queensland Maternal and Perinatal Quality Council 2019"]
[null,"Queensland Mothers and Babies 2018 and 2019: Report of the Queensland Maternal and Perinatal Quality Council 2021"]
[null,"Australian Institute of Health and Welfare National Core Maternity Indicators"]
[]
[null,"Prepared by "]
[]
[null,"Statistical Analysis and Linkage Unit, Statistical Services Branch, Queensland Department of Health"]

{"sheet":"Status_panel","index":2,"n_rows":35,"n_cols":13,"rows_kept":35,"cut":false,"hidden":true,"merged":[]}
["Perr selected:",{"$f":"funnelPivot!B2","v":"Level 6"}]
["More than 1 peer selected:",{"$f":"OR($B$1 = \"(All)\", $B$1 = \"(Multiple Items)\")","v":false}]
[]
["indicator selected:",{"$f":"IF(OR(funnelPivot!B3=\"(All)\", funnelPivot!B3=\"(Multiple Items)\"),\"\", MID(funnelPivot!B3,FIND(\":\",funnelPivot!B3,1)+2,100))","v":"Caesarean section for selected females giving birth for the first time"}]
["More than 1 indicator selected:",{"$f":"OR($B$4 = \"\", $B$4 = \"(Multiple Items)\")","v":false}]
[]
["numerator",{"$f":"VLOOKUP(funnelPivot!B3,getfunneldata!L2:N8,2,FALSE)","v":"The number of selected females giving birth for the first time who gave birth by caesarean section."}]
["title numerator",{"$f":"MID(numerator,FIND(\" of \",numerator)+4,M8)","v":"selected females giving birth for the first time who gave birth by caesarean section"},null,null,null,null,null,null,null,null,{"$f":"FIND(\".\",numerator)","v":99},{"$f":"FIND(\" of \",numerator)+4","v":15},{"$f":"K8-L8","v":84}]
[]
["years selected",{"$f":"funnelPivot!B1","v":"2018 and 2019"}]
["More than 1 biennium selected:",{"$f":"OR($B$10 = \"(All)\", $B$10 = \"(Multiple Items)\")","v":false}]
[]
["Show blocking screen 1:",{"$f":"OR($B$2, $B$5, $B$11)","v":false}]
["Blocking screen text 1:",{"$f":"IF($B$2,\"Select a single peer group\",\"\")","v":""}]
["Blocking screen text 2:",{"$f":"IF($B$5,\"Select a single indicator\",\"\")","v":""}]
["Blocking screen text 3:",{"$f":"IF($B$11,\"Select a single biennium\",\"\")","v":""}]
[]
["peer group:",{"$f":"IF(OR(B2,B11),\"Error in selection\", IF(B1=\"Queensland\",\", by peer group, Queensland, \"&years,\", \"&LOWER(B1)&\" public acute hospitals, Queensland, \"&years))","v":", level 6 public acute hospitals, Queensland, 2018 and 2019"}]
[]
["funnel title",{"$f":"\"Proportion of \"&title_num&$B$18","v":"Proportion of selected females giving birth for the first time who gave birth by caesarean section, level 6 public acute hospitals, Queensland, 2018 and 2019"}]
["bar title",{"$f":"\"Proportion of \"&title_num&$B$18","v":"Proportion of selected females giving birth for the first time who gave birth by caesarean section, level 6 public acute hospitals, Queensland, 2018 and 2019"}]
["table title",{"$f":"\"Number and proportion of \"&title_num&$B$18","v":"Number and proportion of selected females giving birth for the first time who gave birth by caesarean section, level 6 public acute hospitals, Queensland, 2018 and 2019"}]
["title",{"$f":"IF(B5,ind_error,$B$4)","v":"Caesarean section for selected females giving birth for the first time"}]
["peer title",{"$f":"IF(B11,bien_error,IF(B2,peer_error, IF(B1=\"Queensland\",\"by peer group, Queensland, \"&years,IF(B1=\"(All)\",\"\",\"Peer group \"&LOWER(B1)&\" public acute hospitals, Queensland, \"&years))))","v":"Peer group level 6 public acute hospitals, Queensland, 2018 and 2019"}]
[]
["Chart axis limits"]
["ymax",{"$f":"_xlfn.AGGREGATE(4,6,Funnel_data[UCL99.7],Funnel_data[Facility])","v":30.226710154999999}]
["ymin",{"$f":"_xlfn.AGGREGATE(5,6,Funnel_data[99.7% CI],Funnel_data[Facility])","v":22.686477744000001}]
["mean_chart",{"$f":"_xlfn.AGGREGATE(1,6,Funnel_data[Peer group])","v":26.456593948999998}]
["max_chart",{"$f":"CEILING((mean_chart+ABS(MAX(ymax-mean_chart,mean_chart-ymin)))*1.03,5)","v":35}]
["min_chart",{"$f":"FLOOR((mean_chart-ABS(MAX(ymax-mean_chart,mean_chart-ymin)))/1.03,5)","v":20}]
["xmax",{"$f":"_xlfn.AGGREGATE(4,6,Funnel_data[Facility denominator])","v":3711},{"$f":"1*10^(FLOOR(LOG10(xmin),1))","v":1000}]
["xmin",{"$f":"_xlfn.AGGREGATE(5,6,Funnel_data[Facility denominator])","v":1232}]
["min_chart_x",{"$f":"FLOOR(_xlfn.AGGREGATE(5,6,Funnel_data[Facility denominator])/1.03,mag)","v":1000}]
["max_chart_x",{"$f":"CEILING(_xlfn.AGGREGATE(4,6,Funnel_data[Facility denominator])*1.03,mag)","v":4000}]

{"sheet":"funnelPivot","index":3,"n_rows":9,"n_cols":8,"rows_kept":9,"cut":false,"hidden":true,"merged":[]}
["Biennium","2018 and 2019"]
["Peer group","Level 6"]
["Indicator Name","NCMI: Caesarean section for selected females giving birth for the first time"]
[]
["Row Labels","Sum of Denominator","Sum of Fac rate","Sum of Qld rate","Sum of lcl95","Sum of lcl99.7","Sum of ucl95","Sum of ucl99.7"]
["Townsville",1232,27.922077922,26.456593948999998,23.993451361000002,22.686477744000001,28.919736536999999,30.226710154999999]
["Royal Brisbane and Women's",2988,30.020080320999998,26.456593948999998,24.874964981000002,24.035733283999999,28.038222916999999,28.877454614000001]
["Gold Coast University Hospital",3208,23.971321696,26.456593948999998,24.930161016,24.120217011000001,27.983026882000001,28.792970886999999]
["Mater Mothers' Hospital",3711,25.249258959999999,26.456593948999998,25.037374906,24.284319903,27.875812993,28.628867995]

{"sheet":"getfunneldata","index":4,"n_rows":56,"n_cols":14,"rows_kept":56,"cut":false,"hidden":true,"merged":[]}
["Region","Facility denominator","Facility","Peer group","95% CI","99.7% CI","UCL95","UCL99.7",null,null,null,"Numerator and Denominator description"]
[{"$f":"IF(funnelPivot!A6<>0,funnelPivot!A6,NA())","v":"Townsville"},{"$f":"IF(funnelPivot!B6<>0,funnelPivot!B6,NA())","v":1232},{"$f":"IF(funnelPivot!C6<>0,funnelPivot!C6,NA())","v":27.922077922},{"$f":"IF(funnelPivot!D6<>0,funnelPivot!D6,NA())","v":26.456593948999998},{"$f":"IF(funnelPivot!E6<>0,funnelPivot!E6,NA())","v":23.993451361000002},{"$f":"IF(funnelPivot!F6<>0,funnelPivot!F6,NA())","v":22.686477744000001},{"$f":"IF(funnelPivot!G6<>0,funnelPivot!G6,NA())","v":28.919736536999999},{"$f":"IF(funnelPivot!H6<>0,funnelPivot!H6,NA())","v":30.226710154999999},null,null,null,"Indicator category","Numerator description","Denominator description"]
[{"$f":"IF(funnelPivot!A7<>0,funnelPivot!A7,NA())","v":"Royal Brisbane and Women's"},{"$f":"IF(funnelPivot!B7<>0,funnelPivot!B7,NA())","v":2988},{"$f":"IF(funnelPivot!C7<>0,funnelPivot!C7,NA())","v":30.020080320999998},{"$f":"IF(funnelPivot!D7<>0,funnelPivot!D7,NA())","v":26.456593948999998},{"$f":"IF(funnelPivot!E7<>0,funnelPivot!E7,NA())","v":24.874964981000002},{"$f":"IF(funnelPivot!F7<>0,funnelPivot!F7,NA())","v":24.035733283999999},{"$f":"IF(funnelPivot!G7<>0,funnelPivot!G7,NA())","v":28.038222916999999},{"$f":"IF(funnelPivot!H7<>0,funnelPivot!H7,NA())","v":28.877454614000001},null,null,null,"Modified NCMI: Caesarean section for all females giving birth","The number of females who gave birth by caesarean section.","All females who gave birth."]
[{"$f":"IF(funnelPivot!A8<>0,funnelPivot!A8,NA())","v":"Gold Coast University Hospital"},{"$f":"IF(funnelPivot!B8<>0,funnelPivot!B8,NA())","v":3208},{"$f":"IF(funnelPivot!C8<>0,funnelPivot!C8,NA())","v":23.971321696},{"$f":"IF(funnelPivot!D8<>0,funnelPivot!D8,NA())","v":26.456593948999998},{"$f":"IF(funnelPivot!E8<>0,funnelPivot!E8,NA())","v":24.930161016},{"$f":"IF(funnelPivot!F8<>0,funnelPivot!F8,NA())","v":24.120217011000001},{"$f":"IF(funnelPivot!G8<>0,funnelPivot!G8,NA())","v":27.983026882000001},{"$f":"IF(funnelPivot!H8<>0,funnelPivot!H8,NA())","v":28.792970886999999},null,null,null,"NCMI: Induction of labour for selected females giving birth for the first time","The number of selected females who gave birth for the first time and who had labour induced.","All selected females."]
[{"$f":"IF(funnelPivot!A7<>0,funnelPivot!A7,NA())","v":"Royal Brisbane and Women's"},{"$f":"IF(funnelPivot!B7<>0,funnelPivot!B7,NA())","v":2988},{"$f":"IF(funnelPivot!C7<>0,funnelPivot!C7,NA())","v":30.020080320999998},{"$f":"IF(funnelPivot!D7<>0,funnelPivot!D7,NA())","v":26.456593948999998},{"$f":"IF(funnelPivot!E7<>0,funnelPivot!E7,NA())","v":24.874964981000002},{"$f":"IF(funnelPivot!F7<>0,funnelPivot!F7,NA())","v":24.035733283999999},{"$f":"IF(funnelPivot!G7<>0,funnelPivot!G7,NA())","v":28.038222916999999},{"$f":"IF(funnelPivot!H7<>0,funnelPivot!H7,NA())","v":28.877454614000001},null,null,null,"Modified NCMI: Induction of labour for all females giving birth","The number of females who had labour induced.","All females who gave birth."]
[{"$f":"IF(funnelPivot!A8<>0,funnelPivot!A8,NA())","v":"Gold Coast University Hospital"},{"$f":"IF(funnelPivot!B8<>0,funnelPivot!B8,NA())","v":3208},{"$f":"IF(funnelPivot!C8<>0,funnelPivot!C8,NA())","v":23.971321696},{"$f":"IF(funnelPivot!D8<>0,funnelPivot!D8,NA())","v":26.456593948999998},{"$f":"IF(funnelPivot!E8<>0,funnelPivot!E8,NA())","v":24.930161016},{"$f":"IF(funnelPivot!F8<>0,funnelPivot!F8,NA())","v":24.120217011000001},{"$f":"IF(funnelPivot!G8<>0,funnelPivot!G8,NA())","v":27.983026882000001},{"$f":"IF(funnelPivot!H8<>0,funnelPivot!H8,NA())","v":28.792970886999999},null,null,null,"NCMI: Caesarean section for selected females giving birth for the first time","The number of selected females giving birth for the first time who gave birth by caesarean section.","All selected females."]
[{"$f":"IF(funnelPivot!A9<>0,funnelPivot!A9,NA())","v":"Mater Mothers' Hospital"},{"$f":"IF(funnelPivot!B9<>0,funnelPivot!B9,NA())","v":3711},{"$f":"IF(funnelPivot!C9<>0,funnelPivot!C9,NA())","v":25.249258959999999},{"$f":"IF(funnelPivot!D9<>0,funnelPivot!D9,NA())","v":26.456593948999998},{"$f":"IF(funnelPivot!E9<>0,funnelPivot!E9,NA())","v":25.037374906},{"$f":"IF(funnelPivot!F9<>0,funnelPivot!F9,NA())","v":24.284319903},{"$f":"IF(funnelPivot!G9<>0,funnelPivot!G9,NA())","v":27.875812993},{"$f":"IF(funnelPivot!H9<>0,funnelPivot!H9,NA())","v":28.628867995},null,null,null,"NCMI: Non-instrumental vaginal birth for selected females giving birth for the first time","The number of selected females giving birth for the first time who gave birth by non-instrumental vaginal birth.","All selected females."]
[{"$f":"IF(funnelPivot!A10<>0,funnelPivot!A10,NA())","v":{"$error":"#N/A"}},{"$f":"IF(funnelPivot!B10<>0,funnelPivot!B10,NA())","v":{"$error":"#N/A"}},{"$f":"IF(funnelPivot!C10<>0,funnelPivot!C10,NA())","v":{"$error":"#N/A"}},{"$f":"IF(funnelPivot!D10<>0,funnelPivot!D10,NA())","v":{"$error":"#N/A"}},{"$f":"IF(funnelPivot!E10<>0,funnelPivot!E10,NA())","v":{"$error":"#N/A"}},{"$f":"IF(funnelPivot!F10<>0,funnelPivot!F10,NA())","v":{"$error":"#N/A"}},{"$f":"IF(funnelPivot!G10<>0,funnelPivot!G10,NA())","v":{"$error":"#N/A"}},{"$f":"IF(funnelPivot!H10<>0,funnelPivot!H10,NA())","v":{"$error":"#N/A"}},null,null,null,"NCMI: Females having their second birth vaginally whose first birth was by caesarean section","The number of females having their second birth vaginally whose first birth was by caesarean section.","The number of females having their second birth whose first birth was by caesarean section."]
[{"$f":"IF(funnelPivot!A11<>0,funnelPivot!A11,NA())","v":{"$error":"#N/A"}},{"$f":"IF(funnelPivot!B11<>0,funnelPivot!B11,NA())","v":{"$error":"#N/A"}},{"$f":"IF(funnelPivot!C11<>0,funnelPivot!C11,NA())","v":{"$error":"#N/A"}},{"$f":"IF(funnelPivot!D11<>0,funnelPivot!D11,NA())","v":{"$error":"#N/A"}},{"$f":"IF(funnelPivot!E11<>0,funnelPivot!E11,NA())","v":{"$error":"#N/A"}},{"$f":"IF(funnelPivot!F11<>0,funnelPivot!F11,NA())","v":{"$error":"#N/A"}},{"$f":"IF(funnelPivot!G11<>0,funnelPivot!G11,NA())","v":{"$error":"#N/A"}},{"$f":"IF(funnelPivot!H11<>0,funnelPivot!H11,NA())","v":{"$error":"#N/A"}}]
[{"$f":"IF(funnelPivot!A14<>0,funnelPivot!A14,NA())","v":{"$error":"#N/A"}},{"$f":"IF(funnelPivot!B14<>0,funnelPivot!B14,NA())","v":{"$error":"#N/A"}},{"$f":"IF(funnelPivot!C14<>0,funnelPivot!C14,NA())","v":{"$error":"#N/A"}},{"$f":"IF(funnelPivot!D14<>0,funnelPivot!D14,NA())","v":{"$error":"#N/A"}},{"$f":"IF(funnelPivot!E14<>0,funnelPivot!E14,NA())","v":{"$error":"#N/A"}},{"$f":"IF(funnelPivot!F14<>0,funnelPivot!F14,NA())","v":{"$error":"#N/A"}},{"$f":"IF(funnelPivot!G14<>0,funnelPivot!G14,NA())","v":{"$error":"#N/A"}},{"$f":"IF(funnelPivot!H14<>0,funnelPivot!H14,NA())","v":{"$error":"#N/A"}}]
[{"$f":"IF(funnelPivot!A12<>0,funnelPivot!A12,NA())","v":{"$error":"#N/A"}},{"$f":"IF(funnelPivot!B12<>0,funnelPivot!B12,NA())","v":{"$error":"#N/A"}},{"$f":"IF(funnelPivot!C12<>0,funnelPivot!C12,NA())","v":{"$error":"#N/A"}},{"$f":"IF(funnelPivot!D12<>0,funnelPivot!D12,NA())","v":{"$error":"#N/A"}},{"$f":"IF(funnelPivot!E12<>0,funnelPivot!E12,NA())","v":{"$error":"#N/A"}},{"$f":"IF(funnelPivot!F12<>0,funnelPivot!F12,NA())","v":{"$error":"#N/A"}},{"$f":"IF(funnelPivot!G12<>0,funnelPivot!G12,NA())","v":{"$error":"#N/A"}},{"$f":"IF(funnelPivot!H12<>0,funnelPivot!H12,NA())","v":{"$error":"#N/A"}}]
[{"$f":"IF(funnelPivot!A13<>0,funnelPivot!A13,NA())","v":{"$error":"#N/A"}},{"$f":"IF(funnelPivot!B13<>0,funnelPivot!B13,NA())","v":{"$error":"#N/A"}},{"$f":"IF(funnelPivot!C13<>0,funnelPivot!C13,NA())","v":{"$error":"#N/A"}},{"$f":"IF(funnelPivot!D13<>0,funnelPivot!D13,NA())","v":{"$error":"#N/A"}},{"$f":"IF(funnelPivot!E13<>0,funnelPivot!E13,NA())","v":{"$error":"#N/A"}},{"$f":"IF(funnelPivot!F13<>0,funnelPivot!F13,NA())","v":{"$error":"#N/A"}},{"$f":"IF(funnelPivot!G13<>0,funnelPivot!G13,NA())","v":{"$error":"#N/A"}},{"$f":"IF(funnelPivot!H13<>0,funnelPivot!H13,NA())","v":{"$error":"#N/A"}}]
[{"$f":"IF(funnelPivot!A14<>0,funnelPivot!A14,NA())","v":{"$error":"#N/A"}},{"$f":"IF(funnelPivot!B14<>0,funnelPivot!B14,NA())","v":{"$error":"#N/A"}},{"$f":"IF(funnelPivot!C14<>0,funnelPivot!C14,NA())","v":{"$error":"#N/A"}},{"$f":"IF(funnelPivot!D14<>0,funnelPivot!D14,NA())","v":{"$error":"#N/A"}},{"$f":"IF(funnelPivot!E14<>0,funnelPivot!E14,NA())","v":{"$error":"#N/A"}},{"$f":"IF(funnelPivot!F14<>0,funnelPivot!F14,NA())","v":{"$error":"#N/A"}},{"$f":"IF(funnelPivot!G14<>0,funnelPivot!G14,NA())","v":{"$error":"#N/A"}},{"$f":"IF(funnelPivot!H14<>0,funnelPivot!H14,NA())","v":{"$error":"#N/A"}}]
[{"$f":"IF(funnelPivot!A15<>0,funnelPivot!A15,NA())","v":{"$error":"#N/A"}},{"$f":"IF(funnelPivot!B15<>0,funnelPivot!B15,NA())","v":{"$error":"#N/A"}},{"$f":"IF(funnelPivot!C15<>0,funnelPivot!C15,NA())","v":{"$error":"#N/A"}},{"$f":"IF(funnelPivot!D15<>0,funnelPivot!D15,NA())","v":{"$error":"#N/A"}},{"$f":"IF(funnelPivot!E15<>0,funnelPivot!E15,NA())","v":{"$error":"#N/A"}},{"$f":"IF(funnelPivot!F15<>0,funnelPivot!F15,NA())","v":{"$error":"#N/A"}},{"$f":"IF(funnelPivot!G15<>0,funnelPivot!G15,NA())","v":{"$error":"#N/A"}},{"$f":"IF(funnelPivot!H15<>0,funnelPivot!H15,NA())","v":{"$error":"#N/A"}}]
[{"$f":"IF(funnelPivot!A16<>0,funnelPivot!A16,NA())","v":{"$error":"#N/A"}},{"$f":"IF(funnelPivot!B16<>0,funnelPivot!B16,NA())","v":{"$error":"#N/A"}},{"$f":"IF(funnelPivot!C16<>0,funnelPivot!C16,NA())","v":{"$error":"#N/A"}},{"$f":"IF(funnelPivot!D16<>0,funnelPivot!D16,NA())","v":{"$error":"#N/A"}},{"$f":"IF(funnelPivot!E16<>0,funnelPivot!E16,NA())","v":{"$error":"#N/A"}},{"$f":"IF(funnelPivot!F16<>0,funnelPivot!F16,NA())","v":{"$error":"#N/A"}},{"$f":"IF(funnelPivot!G16<>0,funnelPivot!G16,NA())","v":{"$error":"#N/A"}},{"$f":"IF(funnelPivot!H16<>0,funnelPivot!H16,NA())","v":{"$error":"#N/A"}}]
[{"$f":"IF(funnelPivot!A17<>0,funnelPivot!A17,NA())","v":{"$error":"#N/A"}},{"$f":"IF(funnelPivot!B17<>0,funnelPivot!B17,NA())","v":{"$error":"#N/A"}},{"$f":"IF(funnelPivot!C17<>0,funnelPivot!C17,NA())","v":{"$error":"#N/A"}},{"$f":"IF(funnelPivot!D17<>0,funnelPivot!D17,NA())","v":{"$error":"#N/A"}},{"$f":"IF(funnelPivot!E17<>0,funnelPivot!E17,NA())","v":{"$error":"#N/A"}},{"$f":"IF(funnelPivot!F17<>0,funnelPivot!F17,NA())","v":{"$error":"#N/A"}},{"$f":"IF(funnelPivot!G17<>0,funnelPivot!G17,NA())","v":{"$error":"#N/A"}},{"$f":"IF(funnelPivot!H17<>0,funnelPivot!H17,NA())","v":{"$error":"#N/A"}}]
[{"$f":"IF(funnelPivot!A18<>0,funnelPivot!A18,NA())","v":{"$error":"#N/A"}},{"$f":"IF(funnelPivot!B18<>0,funnelPivot!B18,NA())","v":{"$error":"#N/A"}},{"$f":"IF(funnelPivot!C18<>0,funnelPivot!C18,NA())","v":{"$error":"#N/A"}},{"$f":"IF(funnelPivot!D18<>0,funnelPivot!D18,NA())","v":{"$error":"#N/A"}},{"$f":"IF(funnelPivot!E18<>0,funnelPivot!E18,NA())","v":{"$error":"#N/A"}},{"$f":"IF(funnelPivot!F18<>0,funnelPivot!F18,NA())","v":{"$error":"#N/A"}},{"$f":"IF(funnelPivot!G18<>0,funnelPivot!G18,NA())","v":{"$error":"#N/A"}},{"$f":"IF(funnelPivot!H18<>0,funnelPivot!H18,NA())","v":{"$error":"#N/A"}}]
[{"$f":"IF(funnelPivot!A19<>0,funnelPivot!A19,NA())","v":{"$error":"#N/A"}},{"$f":"IF(funnelPivot!B19<>0,funnelPivot!B19,NA())","v":{"$error":"#N/A"}},{"$f":"IF(funnelPivot!C19<>0,funnelPivot!C19,NA())","v":{"$error":"#N/A"}},{"$f":"IF(funnelPivot!D19<>0,funnelPivot!D19,NA())","v":{"$error":"#N/A"}},{"$f":"IF(funnelPivot!E19<>0,funnelPivot!E19,NA())","v":{"$error":"#N/A"}},{"$f":"IF(funnelPivot!F19<>0,funnelPivot!F19,NA())","v":{"$error":"#N/A"}},{"$f":"IF(funnelPivot!G19<>0,funnelPivot!G19,NA())","v":{"$error":"#N/A"}},{"$f":"IF(funnelPivot!H19<>0,funnelPivot!H19,NA())","v":{"$error":"#N/A"}}]
[{"$f":"IF(funnelPivot!A20<>0,funnelPivot!A20,NA())","v":{"$error":"#N/A"}},{"$f":"IF(funnelPivot!B20<>0,funnelPivot!B20,NA())","v":{"$error":"#N/A"}},{"$f":"IF(funnelPivot!C20<>0,funnelPivot!C20,NA())","v":{"$error":"#N/A"}},{"$f":"IF(funnelPivot!D20<>0,funnelPivot!D20,NA())","v":{"$error":"#N/A"}},{"$f":"IF(funnelPivot!E20<>0,funnelPivot!E20,NA())","v":{"$error":"#N/A"}},{"$f":"IF(funnelPivot!F20<>0,funnelPivot!F20,NA())","v":{"$error":"#N/A"}},{"$f":"IF(funnelPivot!G20<>0,funnelPivot!G20,NA())","v":{"$error":"#N/A"}},{"$f":"IF(funnelPivot!H20<>0,funnelPivot!H20,NA())","v":{"$error":"#N/A"}}]
[{"$f":"IF(funnelPivot!A21<>0,funnelPivot!A21,NA())","v":{"$error":"#N/A"}},{"$f":"IF(funnelPivot!B21<>0,funnelPivot!B21,NA())","v":{"$error":"#N/A"}},{"$f":"IF(funnelPivot!C21<>0,funnelPivot!C21,NA())","v":{"$error":"#N/A"}},{"$f":"IF(funnelPivot!D21<>0,funnelPivot!D21,NA())","v":{"$error":"#N/A"}},{"$f":"IF(funnelPivot!E21<>0,funnelPivot!E21,NA())","v":{"$error":"#N/A"}},{"$f":"IF(funnelPivot!F21<>0,funnelPivot!F21,NA())","v":{"$error":"#N/A"}},{"$f":"IF(funnelPivot!G21<>0,funnelPivot!G21,NA())","v":{"$error":"#N/A"}},{"$f":"IF(funnelPivot!H21<>0,funnelPivot!H21,NA())","v":{"$error":"#N/A"}}]
[{"$f":"IF(funnelPivot!A22<>0,funnelPivot!A22,NA())","v":{"$error":"#N/A"}},{"$f":"IF(funnelPivot!B22<>0,funnelPivot!B22,NA())","v":{"$error":"#N/A"}},{"$f":"IF(funnelPivot!C22<>0,funnelPivot!C22,NA())","v":{"$error":"#N/A"}},{"$f":"IF(funnelPivot!D22<>0,funnelPivot!D22,NA())","v":{"$error":"#N/A"}},{"$f":"IF(funnelPivot!E22<>0,funnelPivot!E22,NA())","v":{"$error":"#N/A"}},{"$f":"IF(funnelPivot!F22<>0,funnelPivot!F22,NA())","v":{"$error":"#N/A"}},{"$f":"IF(funnelPivot!G22<>0,funnelPivot!G22,NA())","v":{"$error":"#N/A"}},{"$f":"IF(funnelPivot!H22<>0,funnelPivot!H22,NA())","v":{"$error":"#N/A"}}]
[{"$f":"IF(funnelPivot!A23<>0,funnelPivot!A23,NA())","v":{"$error":"#N/A"}},{"$f":"IF(funnelPivot!B23<>0,funnelPivot!B23,NA())","v":{"$error":"#N/A"}},{"$f":"IF(funnelPivot!C23<>0,funnelPivot!C23,NA())","v":{"$error":"#N/A"}},{"$f":"IF(funnelPivot!D23<>0,funnelPivot!D23,NA())","v":{"$error":"#N/A"}},{"$f":"IF(funnelPivot!E23<>0,funnelPivot!E23,NA())","v":{"$error":"#N/A"}},{"$f":"IF(funnelPivot!F23<>0,funnelPivot!F23,NA())","v":{"$error":"#N/A"}},{"$f":"IF(funnelPivot!G23<>0,funnelPivot!G23,NA())","v":{"$error":"#N/A"}},{"$f":"IF(funnelPivot!H23<>0,funnelPivot!H23,NA())","v":{"$error":"#N/A"}}]
[{"$f":"IF(funnelPivot!A24<>0,funnelPivot!A24,NA())","v":{"$error":"#N/A"}},{"$f":"IF(funnelPivot!B24<>0,funnelPivot!B24,NA())","v":{"$error":"#N/A"}},{"$f":"IF(funnelPivot!C24<>0,funnelPivot!C24,NA())","v":{"$error":"#N/A"}},{"$f":"IF(funnelPivot!D24<>0,funnelPivot!D24,NA())","v":{"$error":"#N/A"}},{"$f":"IF(funnelPivot!E24<>0,funnelPivot!E24,NA())","v":{"$error":"#N/A"}},{"$f":"IF(funnelPivot!F24<>0,funnelPivot!F24,NA())","v":{"$error":"#N/A"}},{"$f":"IF(funnelPivot!G24<>0,funnelPivot!G24,NA())","v":{"$error":"#N/A"}},{"$f":"IF(funnelPivot!H24<>0,funnelPivot!H24,NA())","v":{"$error":"#N/A"}}]
[{"$f":"IF(funnelPivot!A25<>0,funnelPivot!A25,NA())","v":{"$error":"#N/A"}},{"$f":"IF(funnelPivot!B25<>0,funnelPivot!B25,NA())","v":{"$error":"#N/A"}},{"$f":"IF(funnelPivot!C25<>0,funnelPivot!C25,NA())","v":{"$error":"#N/A"}},{"$f":"IF(funnelPivot!D25<>0,funnelPivot!D25,NA())","v":{"$error":"#N/A"}},{"$f":"IF(funnelPivot!E25<>0,funnelPivot!E25,NA())","v":{"$error":"#N/A"}},{"$f":"IF(funnelPivot!F25<>0,funnelPivot!F25,NA())","v":{"$error":"#N/A"}},{"$f":"IF(funnelPivot!G25<>0,funnelPivot!G25,NA())","v":{"$error":"#N/A"}},{"$f":"IF(funnelPivot!H25<>0,funnelPivot!H25,NA())","v":{"$error":"#N/A"}}]
[{"$f":"IF(funnelPivot!A26<>0,funnelPivot!A26,NA())","v":{"$error":"#N/A"}},{"$f":"IF(funnelPivot!B26<>0,funnelPivot!B26,NA())","v":{"$error":"#N/A"}},{"$f":"IF(funnelPivot!C26<>0,funnelPivot!C26,NA())","v":{"$error":"#N/A"}},{"$f":"IF(funnelPivot!D26<>0,funnelPivot!D26,NA())","v":{"$error":"#N/A"}},{"$f":"IF(funnelPivot!E26<>0,funnelPivot!E26,NA())","v":{"$error":"#N/A"}},{"$f":"IF(funnelPivot!F26<>0,funnelPivot!F26,NA())","v":{"$error":"#N/A"}},{"$f":"IF(funnelPivot!G26<>0,funnelPivot!G26,NA())","v":{"$error":"#N/A"}},{"$f":"IF(funnelPivot!H26<>0,funnelPivot!H26,NA())","v":{"$error":"#N/A"}}]
[{"$f":"IF(funnelPivot!A27<>0,funnelPivot!A27,NA())","v":{"$error":"#N/A"}},{"$f":"IF(funnelPivot!B27<>0,funnelPivot!B27,NA())","v":{"$error":"#N/A"}},{"$f":"IF(funnelPivot!C27<>0,funnelPivot!C27,NA())","v":{"$error":"#N/A"}},{"$f":"IF(funnelPivot!D27<>0,funnelPivot!D27,NA())","v":{"$error":"#N/A"}},{"$f":"IF(funnelPivot!E27<>0,funnelPivot!E27,NA())","v":{"$error":"#N/A"}},{"$f":"IF(funnelPivot!F27<>0,funnelPivot!F27,NA())","v":{"$error":"#N/A"}},{"$f":"IF(funnelPivot!G27<>0,funnelPivot!G27,NA())","v":{"$error":"#N/A"}},{"$f":"IF(funnelPivot!H27<>0,funnelPivot!H27,NA())","v":{"$error":"#N/A"}}]
[{"$f":"IF(funnelPivot!A28<>0,funnelPivot!A28,NA())","v":{"$error":"#N/A"}},{"$f":"IF(funnelPivot!B28<>0,funnelPivot!B28,NA())","v":{"$error":"#N/A"}},{"$f":"IF(funnelPivot!C28<>0,funnelPivot!C28,NA())","v":{"$error":"#N/A"}},{"$f":"IF(funnelPivot!D28<>0,funnelPivot!D28,NA())","v":{"$error":"#N/A"}},{"$f":"IF(funnelPivot!E28<>0,funnelPivot!E28,NA())","v":{"$error":"#N/A"}},{"$f":"IF(funnelPivot!F28<>0,funnelPivot!F28,NA())","v":{"$error":"#N/A"}},{"$f":"IF(funnelPivot!G28<>0,funnelPivot!G28,NA())","v":{"$error":"#N/A"}},{"$f":"IF(funnelPivot!H28<>0,funnelPivot!H28,NA())","v":{"$error":"#N/A"}}]
[{"$f":"IF(funnelPivot!A29<>0,funnelPivot!A29,NA())","v":{"$error":"#N/A"}},{"$f":"IF(funnelPivot!B29<>0,funnelPivot!B29,NA())","v":{"$error":"#N/A"}},{"$f":"IF(funnelPivot!C29<>0,funnelPivot!C29,NA())","v":{"$error":"#N/A"}},{"$f":"IF(funnelPivot!D29<>0,funnelPivot!D29,NA())","v":{"$error":"#N/A"}},{"$f":"IF(funnelPivot!E29<>0,funnelPivot!E29,NA())","v":{"$error":"#N/A"}},{"$f":"IF(funnelPivot!F29<>0,funnelPivot!F29,NA())","v":{"$error":"#N/A"}},{"$f":"IF(funnelPivot!G29<>0,funnelPivot!G29,NA())","v":{"$error":"#N/A"}},{"$f":"IF(funnelPivot!H29<>0,funnelPivot!H29,NA())","v":{"$error":"#N/A"}}]
[{"$f":"IF(funnelPivot!A30<>0,funnelPivot!A30,NA())","v":{"$error":"#N/A"}},{"$f":"IF(funnelPivot!B30<>0,funnelPivot!B30,NA())","v":{"$error":"#N/A"}},{"$f":"IF(funnelPivot!C30<>0,funnelPivot!C30,NA())","v":{"$error":"#N/A"}},{"$f":"IF(funnelPivot!D30<>0,funnelPivot!D30,NA())","v":{"$error":"#N/A"}},{"$f":"IF(funnelPivot!E30<>0,funnelPivot!E30,NA())","v":{"$error":"#N/A"}},{"$f":"IF(funnelPivot!F30<>0,funnelPivot!F30,NA())","v":{"$error":"#N/A"}},{"$f":"IF(funnelPivot!G30<>0,funnelPivot!G30,NA())","v":{"$error":"#N/A"}},{"$f":"IF(funnelPivot!H30<>0,funnelPivot!H30,NA())","v":{"$error":"#N/A"}}]
[{"$f":"IF(funnelPivot!A31<>0,funnelPivot!A31,NA())","v":{"$error":"#N/A"}},{"$f":"IF(funnelPivot!B31<>0,funnelPivot!B31,NA())","v":{"$error":"#N/A"}},{"$f":"IF(funnelPivot!C31<>0,funnelPivot!C31,NA())","v":{"$error":"#N/A"}},{"$f":"IF(funnelPivot!D31<>0,funnelPivot!D31,NA())","v":{"$error":"#N/A"}},{"$f":"IF(funnelPivot!E31<>0,funnelPivot!E31,NA())","v":{"$error":"#N/A"}},{"$f":"IF(funnelPivot!F31<>0,funnelPivot!F31,NA())","v":{"$error":"#N/A"}},{"$f":"IF(funnelPivot!G31<>0,funnelPivot!G31,NA())","v":{"$error":"#N/A"}},{"$f":"IF(funnelPivot!H31<>0,funnelPivot!H31,NA())","v":{"$error":"#N/A"}}]
[{"$f":"IF(funnelPivot!A32<>0,funnelPivot!A32,NA())","v":{"$error":"#N/A"}},{"$f":"IF(funnelPivot!B32<>0,funnelPivot!B32,NA())","v":{"$error":"#N/A"}},{"$f":"IF(funnelPivot!C32<>0,funnelPivot!C32,NA())","v":{"$error":"#N/A"}},{"$f":"IF(funnelPivot!D32<>0,funnelPivot!D32,NA())","v":{"$error":"#N/A"}},{"$f":"IF(funnelPivot!E32<>0,funnelPivot!E32,NA())","v":{"$error":"#N/A"}},{"$f":"IF(funnelPivot!F32<>0,funnelPivot!F32,NA())","v":{"$error":"#N/A"}},{"$f":"IF(funnelPivot!G32<>0,funnelPivot!G32,NA())","v":{"$error":"#N/A"}},{"$f":"IF(funnelPivot!H32<>0,funnelPivot!H32,NA())","v":{"$error":"#N/A"}}]
[{"$f":"IF(funnelPivot!A33<>0,funnelPivot!A33,NA())","v":{"$error":"#N/A"}},{"$f":"IF(funnelPivot!B33<>0,funnelPivot!B33,NA())","v":{"$error":"#N/A"}},{"$f":"IF(funnelPivot!C33<>0,funnelPivot!C33,NA())","v":{"$error":"#N/A"}},{"$f":"IF(funnelPivot!D33<>0,funnelPivot!D33,NA())","v":{"$error":"#N/A"}},{"$f":"IF(funnelPivot!E33<>0,funnelPivot!E33,NA())","v":{"$error":"#N/A"}},{"$f":"IF(funnelPivot!F33<>0,funnelPivot!F33,NA())","v":{"$error":"#N/A"}},{"$f":"IF(funnelPivot!G33<>0,funnelPivot!G33,NA())","v":{"$error":"#N/A"}},{"$f":"IF(funnelPivot!H33<>0,funnelPivot!H33,NA())","v":{"$error":"#N/A"}}]
[{"$f":"IF(funnelPivot!A34<>0,funnelPivot!A34,NA())","v":{"$error":"#N/A"}},{"$f":"IF(funnelPivot!B34<>0,funnelPivot!B34,NA())","v":{"$error":"#N/A"}},{"$f":"IF(funnelPivot!C34<>0,funnelPivot!C34,NA())","v":{"$error":"#N/A"}},{"$f":"IF(funnelPivot!D34<>0,funnelPivot!D34,NA())","v":{"$error":"#N/A"}},{"$f":"IF(funnelPivot!E34<>0,funnelPivot!E34,NA())","v":{"$error":"#N/A"}},{"$f":"IF(funnelPivot!F34<>0,funnelPivot!F34,NA())","v":{"$error":"#N/A"}},{"$f":"IF(funnelPivot!G34<>0,funnelPivot!G34,NA())","v":{"$error":"#N/A"}},{"$f":"IF(funnelPivot!H34<>0,funnelPivot!H34,NA())","v":{"$error":"#N/A"}}]
[{"$f":"IF(funnelPivot!A35<>0,funnelPivot!A35,NA())","v":{"$error":"#N/A"}},{"$f":"IF(funnelPivot!B35<>0,funnelPivot!B35,NA())","v":{"$error":"#N/A"}},{"$f":"IF(funnelPivot!C35<>0,funnelPivot!C35,NA())","v":{"$error":"#N/A"}},{"$f":"IF(funnelPivot!D35<>0,funnelPivot!D35,NA())","v":{"$error":"#N/A"}},{"$f":"IF(funnelPivot!E35<>0,funnelPivot!E35,NA())","v":{"$error":"#N/A"}},{"$f":"IF(funnelPivot!F35<>0,funnelPivot!F35,NA())","v":{"$error":"#N/A"}},{"$f":"IF(funnelPivot!G35<>0,funnelPivot!G35,NA())","v":{"$error":"#N/A"}},{"$f":"IF(funnelPivot!H35<>0,funnelPivot!H35,NA())","v":{"$error":"#N/A"}}]
[{"$f":"IF(funnelPivot!A36<>0,funnelPivot!A36,NA())","v":{"$error":"#N/A"}},{"$f":"IF(funnelPivot!B36<>0,funnelPivot!B36,NA())","v":{"$error":"#N/A"}},{"$f":"IF(funnelPivot!C36<>0,funnelPivot!C36,NA())","v":{"$error":"#N/A"}},{"$f":"IF(funnelPivot!D36<>0,funnelPivot!D36,NA())","v":{"$error":"#N/A"}},{"$f":"IF(funnelPivot!E36<>0,funnelPivot!E36,NA())","v":{"$error":"#N/A"}},{"$f":"IF(funnelPivot!F36<>0,funnelPivot!F36,NA())","v":{"$error":"#N/A"}},{"$f":"IF(funnelPivot!G36<>0,funnelPivot!G36,NA())","v":{"$error":"#N/A"}},{"$f":"IF(funnelPivot!H36<>0,funnelPivot!H36,NA())","v":{"$error":"#N/A"}}]
[{"$f":"IF(funnelPivot!A37<>0,funnelPivot!A37,NA())","v":{"$error":"#N/A"}},{"$f":"IF(funnelPivot!B37<>0,funnelPivot!B37,NA())","v":{"$error":"#N/A"}},{"$f":"IF(funnelPivot!C37<>0,funnelPivot!C37,NA())","v":{"$error":"#N/A"}},{"$f":"IF(funnelPivot!D37<>0,funnelPivot!D37,NA())","v":{"$error":"#N/A"}},{"$f":"IF(funnelPivot!E37<>0,funnelPivot!E37,NA())","v":{"$error":"#N/A"}},{"$f":"IF(funnelPivot!F37<>0,funnelPivot!F37,NA())","v":{"$error":"#N/A"}},{"$f":"IF(funnelPivot!G37<>0,funnelPivot!G37,NA())","v":{"$error":"#N/A"}},{"$f":"IF(funnelPivot!H37<>0,funnelPivot!H37,NA())","v":{"$error":"#N/A"}}]
[{"$f":"IF(funnelPivot!A38<>0,funnelPivot!A38,NA())","v":{"$error":"#N/A"}},{"$f":"IF(funnelPivot!B38<>0,funnelPivot!B38,NA())","v":{"$error":"#N/A"}},{"$f":"IF(funnelPivot!C38<>0,funnelPivot!C38,NA())","v":{"$error":"#N/A"}},{"$f":"IF(funnelPivot!D38<>0,funnelPivot!D38,NA())","v":{"$error":"#N/A"}},{"$f":"IF(funnelPivot!E38<>0,funnelPivot!E38,NA())","v":{"$error":"#N/A"}},{"$f":"IF(funnelPivot!F38<>0,funnelPivot!F38,NA())","v":{"$error":"#N/A"}},{"$f":"IF(funnelPivot!G38<>0,funnelPivot!G38,NA())","v":{"$error":"#N/A"}},{"$f":"IF(funnelPivot!H38<>0,funnelPivot!H38,NA())","v":{"$error":"#N/A"}}]
[{"$f":"IF(funnelPivot!A39<>0,funnelPivot!A39,NA())","v":{"$error":"#N/A"}},{"$f":"IF(funnelPivot!B39<>0,funnelPivot!B39,NA())","v":{"$error":"#N/A"}},{"$f":"IF(funnelPivot!C39<>0,funnelPivot!C39,NA())","v":{"$error":"#N/A"}},{"$f":"IF(funnelPivot!D39<>0,funnelPivot!D39,NA())","v":{"$error":"#N/A"}},{"$f":"IF(funnelPivot!E39<>0,funnelPivot!E39,NA())","v":{"$error":"#N/A"}},{"$f":"IF(funnelPivot!F39<>0,funnelPivot!F39,NA())","v":{"$error":"#N/A"}},{"$f":"IF(funnelPivot!G39<>0,funnelPivot!G39,NA())","v":{"$error":"#N/A"}},{"$f":"IF(funnelPivot!H39<>0,funnelPivot!H39,NA())","v":{"$error":"#N/A"}}]
[{"$f":"IF(funnelPivot!A40<>0,funnelPivot!A40,NA())","v":{"$error":"#N/A"}},{"$f":"IF(funnelPivot!B40<>0,funnelPivot!B40,NA())","v":{"$error":"#N/A"}},{"$f":"IF(funnelPivot!C40<>0,funnelPivot!C40,NA())","v":{"$error":"#N/A"}},{"$f":"IF(funnelPivot!D40<>0,funnelPivot!D40,NA())","v":{"$error":"#N/A"}},{"$f":"IF(funnelPivot!E40<>0,funnelPivot!E40,NA())","v":{"$error":"#N/A"}},{"$f":"IF(funnelPivot!F40<>0,funnelPivot!F40,NA())","v":{"$error":"#N/A"}},{"$f":"IF(funnelPivot!G40<>0,funnelPivot!G40,NA())","v":{"$error":"#N/A"}},{"$f":"IF(funnelPivot!H40<>0,funnelPivot!H40,NA())","v":{"$error":"#N/A"}}]
[{"$f":"IF(funnelPivot!A41<>0,funnelPivot!A41,NA())","v":{"$error":"#N/A"}},{"$f":"IF(funnelPivot!B41<>0,funnelPivot!B41,NA())","v":{"$error":"#N/A"}},{"$f":"IF(funnelPivot!C41<>0,funnelPivot!C41,NA())","v":{"$error":"#N/A"}},{"$f":"IF(funnelPivot!D41<>0,funnelPivot!D41,NA())","v":{"$error":"#N/A"}},{"$f":"IF(funnelPivot!E41<>0,funnelPivot!E41,NA())","v":{"$error":"#N/A"}},{"$f":"IF(funnelPivot!F41<>0,funnelPivot!F41,NA())","v":{"$error":"#N/A"}},{"$f":"IF(funnelPivot!G41<>0,funnelPivot!G41,NA())","v":{"$error":"#N/A"}},{"$f":"IF(funnelPivot!H41<>0,funnelPivot!H41,NA())","v":{"$error":"#N/A"}}]
[{"$f":"IF(funnelPivot!A42<>0,funnelPivot!A42,NA())","v":{"$error":"#N/A"}},{"$f":"IF(funnelPivot!B42<>0,funnelPivot!B42,NA())","v":{"$error":"#N/A"}},{"$f":"IF(funnelPivot!C42<>0,funnelPivot!C42,NA())","v":{"$error":"#N/A"}},{"$f":"IF(funnelPivot!D42<>0,funnelPivot!D42,NA())","v":{"$error":"#N/A"}},{"$f":"IF(funnelPivot!E42<>0,funnelPivot!E42,NA())","v":{"$error":"#N/A"}},{"$f":"IF(funnelPivot!F42<>0,funnelPivot!F42,NA())","v":{"$error":"#N/A"}},{"$f":"IF(funnelPivot!G42<>0,funnelPivot!G42,NA())","v":{"$error":"#N/A"}},{"$f":"IF(funnelPivot!H42<>0,funnelPivot!H42,NA())","v":{"$error":"#N/A"}}]
[{"$f":"IF(funnelPivot!A43<>0,funnelPivot!A43,NA())","v":{"$error":"#N/A"}},{"$f":"IF(funnelPivot!B43<>0,funnelPivot!B43,NA())","v":{"$error":"#N/A"}},{"$f":"IF(funnelPivot!C43<>0,funnelPivot!C43,NA())","v":{"$error":"#N/A"}},{"$f":"IF(funnelPivot!D43<>0,funnelPivot!D43,NA())","v":{"$error":"#N/A"}},{"$f":"IF(funnelPivot!E43<>0,funnelPivot!E43,NA())","v":{"$error":"#N/A"}},{"$f":"IF(funnelPivot!F43<>0,funnelPivot!F43,NA())","v":{"$error":"#N/A"}},{"$f":"IF(funnelPivot!G43<>0,funnelPivot!G43,NA())","v":{"$error":"#N/A"}},{"$f":"IF(funnelPivot!H43<>0,funnelPivot!H43,NA())","v":{"$error":"#N/A"}}]
[{"$f":"IF(funnelPivot!A44<>0,funnelPivot!A44,NA())","v":{"$error":"#N/A"}},{"$f":"IF(funnelPivot!B44<>0,funnelPivot!B44,NA())","v":{"$error":"#N/A"}},{"$f":"IF(funnelPivot!C44<>0,funnelPivot!C44,NA())","v":{"$error":"#N/A"}},{"$f":"IF(funnelPivot!D44<>0,funnelPivot!D44,NA())","v":{"$error":"#N/A"}},{"$f":"IF(funnelPivot!E44<>0,funnelPivot!E44,NA())","v":{"$error":"#N/A"}},{"$f":"IF(funnelPivot!F44<>0,funnelPivot!F44,NA())","v":{"$error":"#N/A"}},{"$f":"IF(funnelPivot!G44<>0,funnelPivot!G44,NA())","v":{"$error":"#N/A"}},{"$f":"IF(funnelPivot!H44<>0,funnelPivot!H44,NA())","v":{"$error":"#N/A"}}]
[{"$f":"IF(funnelPivot!A45<>0,funnelPivot!A45,NA())","v":{"$error":"#N/A"}},{"$f":"IF(funnelPivot!B45<>0,funnelPivot!B45,NA())","v":{"$error":"#N/A"}},{"$f":"IF(funnelPivot!C45<>0,funnelPivot!C45,NA())","v":{"$error":"#N/A"}},{"$f":"IF(funnelPivot!D45<>0,funnelPivot!D45,NA())","v":{"$error":"#N/A"}},{"$f":"IF(funnelPivot!E45<>0,funnelPivot!E45,NA())","v":{"$error":"#N/A"}},{"$f":"IF(funnelPivot!F45<>0,funnelPivot!F45,NA())","v":{"$error":"#N/A"}},{"$f":"IF(funnelPivot!G45<>0,funnelPivot!G45,NA())","v":{"$error":"#N/A"}},{"$f":"IF(funnelPivot!H45<>0,funnelPivot!H45,NA())","v":{"$error":"#N/A"}}]
[{"$f":"IF(funnelPivot!A46<>0,funnelPivot!A46,NA())","v":{"$error":"#N/A"}},{"$f":"IF(funnelPivot!B46<>0,funnelPivot!B46,NA())","v":{"$error":"#N/A"}},{"$f":"IF(funnelPivot!C46<>0,funnelPivot!C46,NA())","v":{"$error":"#N/A"}},{"$f":"IF(funnelPivot!D46<>0,funnelPivot!D46,NA())","v":{"$error":"#N/A"}},{"$f":"IF(funnelPivot!E46<>0,funnelPivot!E46,NA())","v":{"$error":"#N/A"}},{"$f":"IF(funnelPivot!F46<>0,funnelPivot!F46,NA())","v":{"$error":"#N/A"}},{"$f":"IF(funnelPivot!G46<>0,funnelPivot!G46,NA())","v":{"$error":"#N/A"}},{"$f":"IF(funnelPivot!H46<>0,funnelPivot!H46,NA())","v":{"$error":"#N/A"}}]
[{"$f":"IF(funnelPivot!A47<>0,funnelPivot!A47,NA())","v":{"$error":"#N/A"}},{"$f":"IF(funnelPivot!B47<>0,funnelPivot!B47,NA())","v":{"$error":"#N/A"}},{"$f":"IF(funnelPivot!C47<>0,funnelPivot!C47,NA())","v":{"$error":"#N/A"}},{"$f":"IF(funnelPivot!D47<>0,funnelPivot!D47,NA())","v":{"$error":"#N/A"}},{"$f":"IF(funnelPivot!E47<>0,funnelPivot!E47,NA())","v":{"$error":"#N/A"}},{"$f":"IF(funnelPivot!F47<>0,funnelPivot!F47,NA())","v":{"$error":"#N/A"}},{"$f":"IF(funnelPivot!G47<>0,funnelPivot!G47,NA())","v":{"$error":"#N/A"}},{"$f":"IF(funnelPivot!H47<>0,funnelPivot!H47,NA())","v":{"$error":"#N/A"}}]
[{"$f":"IF(funnelPivot!A48<>0,funnelPivot!A48,NA())","v":{"$error":"#N/A"}},{"$f":"IF(funnelPivot!B48<>0,funnelPivot!B48,NA())","v":{"$error":"#N/A"}},{"$f":"IF(funnelPivot!C48<>0,funnelPivot!C48,NA())","v":{"$error":"#N/A"}},{"$f":"IF(funnelPivot!D48<>0,funnelPivot!D48,NA())","v":{"$error":"#N/A"}},{"$f":"IF(funnelPivot!E48<>0,funnelPivot!E48,NA())","v":{"$error":"#N/A"}},{"$f":"IF(funnelPivot!F48<>0,funnelPivot!F48,NA())","v":{"$error":"#N/A"}},{"$f":"IF(funnelPivot!G48<>0,funnelPivot!G48,NA())","v":{"$error":"#N/A"}},{"$f":"IF(funnelPivot!H48<>0,funnelPivot!H48,NA())","v":{"$error":"#N/A"}}]
[{"$f":"IF(funnelPivot!A49<>0,funnelPivot!A49,NA())","v":{"$error":"#N/A"}},{"$f":"IF(funnelPivot!B49<>0,funnelPivot!B49,NA())","v":{"$error":"#N/A"}},{"$f":"IF(funnelPivot!C49<>0,funnelPivot!C49,NA())","v":{"$error":"#N/A"}},{"$f":"IF(funnelPivot!D49<>0,funnelPivot!D49,NA())","v":{"$error":"#N/A"}},{"$f":"IF(funnelPivot!E49<>0,funnelPivot!E49,NA())","v":{"$error":"#N/A"}},{"$f":"IF(funnelPivot!F49<>0,funnelPivot!F49,NA())","v":{"$error":"#N/A"}},{"$f":"IF(funnelPivot!G49<>0,funnelPivot!G49,NA())","v":{"$error":"#N/A"}},{"$f":"IF(funnelPivot!H49<>0,funnelPivot!H49,NA())","v":{"$error":"#N/A"}}]
[{"$f":"IF(funnelPivot!A50<>0,funnelPivot!A50,NA())","v":{"$error":"#N/A"}},{"$f":"IF(funnelPivot!B50<>0,funnelPivot!B50,NA())","v":{"$error":"#N/A"}},{"$f":"IF(funnelPivot!C50<>0,funnelPivot!C50,NA())","v":{"$error":"#N/A"}},{"$f":"IF(funnelPivot!D50<>0,funnelPivot!D50,NA())","v":{"$error":"#N/A"}},{"$f":"IF(funnelPivot!E50<>0,funnelPivot!E50,NA())","v":{"$error":"#N/A"}},{"$f":"IF(funnelPivot!F50<>0,funnelPivot!F50,NA())","v":{"$error":"#N/A"}},{"$f":"IF(funnelPivot!G50<>0,funnelPivot!G50,NA())","v":{"$error":"#N/A"}},{"$f":"IF(funnelPivot!H50<>0,funnelPivot!H50,NA())","v":{"$error":"#N/A"}}]
[{"$f":"IF(funnelPivot!A51<>0,funnelPivot!A51,NA())","v":{"$error":"#N/A"}},{"$f":"IF(funnelPivot!B51<>0,funnelPivot!B51,NA())","v":{"$error":"#N/A"}},{"$f":"IF(funnelPivot!C51<>0,funnelPivot!C51,NA())","v":{"$error":"#N/A"}},{"$f":"IF(funnelPivot!D51<>0,funnelPivot!D51,NA())","v":{"$error":"#N/A"}},{"$f":"IF(funnelPivot!E51<>0,funnelPivot!E51,NA())","v":{"$error":"#N/A"}},{"$f":"IF(funnelPivot!F51<>0,funnelPivot!F51,NA())","v":{"$error":"#N/A"}},{"$f":"IF(funnelPivot!G51<>0,funnelPivot!G51,NA())","v":{"$error":"#N/A"}},{"$f":"IF(funnelPivot!H51<>0,funnelPivot!H51,NA())","v":{"$error":"#N/A"}}]
[{"$f":"IF(funnelPivot!A52<>0,funnelPivot!A52,NA())","v":{"$error":"#N/A"}},{"$f":"IF(funnelPivot!B52<>0,funnelPivot!B52,NA())","v":{"$error":"#N/A"}},{"$f":"IF(funnelPivot!C52<>0,funnelPivot!C52,NA())","v":{"$error":"#N/A"}},{"$f":"IF(funnelPivot!D52<>0,funnelPivot!D52,NA())","v":{"$error":"#N/A"}},{"$f":"IF(funnelPivot!E52<>0,funnelPivot!E52,NA())","v":{"$error":"#N/A"}},{"$f":"IF(funnelPivot!F52<>0,funnelPivot!F52,NA())","v":{"$error":"#N/A"}},{"$f":"IF(funnelPivot!G52<>0,funnelPivot!G52,NA())","v":{"$error":"#N/A"}},{"$f":"IF(funnelPivot!H52<>0,funnelPivot!H52,NA())","v":{"$error":"#N/A"}}]
[{"$f":"IF(funnelPivot!A53<>0,funnelPivot!A53,NA())","v":{"$error":"#N/A"}},{"$f":"IF(funnelPivot!B53<>0,funnelPivot!B53,NA())","v":{"$error":"#N/A"}},{"$f":"IF(funnelPivot!C53<>0,funnelPivot!C53,NA())","v":{"$error":"#N/A"}},{"$f":"IF(funnelPivot!D53<>0,funnelPivot!D53,NA())","v":{"$error":"#N/A"}},{"$f":"IF(funnelPivot!E53<>0,funnelPivot!E53,NA())","v":{"$error":"#N/A"}},{"$f":"IF(funnelPivot!F53<>0,funnelPivot!F53,NA())","v":{"$error":"#N/A"}},{"$f":"IF(funnelPivot!G53<>0,funnelPivot!G53,NA())","v":{"$error":"#N/A"}},{"$f":"IF(funnelPivot!H53<>0,funnelPivot!H53,NA())","v":{"$error":"#N/A"}}]
[{"$f":"IF(funnelPivot!A54<>0,funnelPivot!A54,NA())","v":{"$error":"#N/A"}},{"$f":"IF(funnelPivot!B54<>0,funnelPivot!B54,NA())","v":{"$error":"#N/A"}},{"$f":"IF(funnelPivot!C54<>0,funnelPivot!C54,NA())","v":{"$error":"#N/A"}},{"$f":"IF(funnelPivot!D54<>0,funnelPivot!D54,NA())","v":{"$error":"#N/A"}},{"$f":"IF(funnelPivot!E54<>0,funnelPivot!E54,NA())","v":{"$error":"#N/A"}},{"$f":"IF(funnelPivot!F54<>0,funnelPivot!F54,NA())","v":{"$error":"#N/A"}},{"$f":"IF(funnelPivot!G54<>0,funnelPivot!G54,NA())","v":{"$error":"#N/A"}},{"$f":"IF(funnelPivot!H54<>0,funnelPivot!H54,NA())","v":{"$error":"#N/A"}}]
[{"$f":"IF(funnelPivot!A55<>0,funnelPivot!A55,NA())","v":{"$error":"#N/A"}},{"$f":"IF(funnelPivot!B55<>0,funnelPivot!B55,NA())","v":{"$error":"#N/A"}},{"$f":"IF(funnelPivot!C55<>0,funnelPivot!C55,NA())","v":{"$error":"#N/A"}},{"$f":"IF(funnelPivot!D55<>0,funnelPivot!D55,NA())","v":{"$error":"#N/A"}},{"$f":"IF(funnelPivot!E55<>0,funnelPivot!E55,NA())","v":{"$error":"#N/A"}},{"$f":"IF(funnelPivot!F55<>0,funnelPivot!F55,NA())","v":{"$error":"#N/A"}},{"$f":"IF(funnelPivot!G55<>0,funnelPivot!G55,NA())","v":{"$error":"#N/A"}},{"$f":"IF(funnelPivot!H55<>0,funnelPivot!H55,NA())","v":{"$error":"#N/A"}}]
[{"$f":"IF(funnelPivot!A56<>0,funnelPivot!A56,NA())","v":{"$error":"#N/A"}},{"$f":"IF(funnelPivot!B56<>0,funnelPivot!B56,NA())","v":{"$error":"#N/A"}},{"$f":"IF(funnelPivot!C56<>0,funnelPivot!C56,NA())","v":{"$error":"#N/A"}},{"$f":"IF(funnelPivot!D56<>0,funnelPivot!D56,NA())","v":{"$error":"#N/A"}},{"$f":"IF(funnelPivot!E56<>0,funnelPivot!E56,NA())","v":{"$error":"#N/A"}},{"$f":"IF(funnelPivot!F56<>0,funnelPivot!F56,NA())","v":{"$error":"#N/A"}},{"$f":"IF(funnelPivot!G56<>0,funnelPivot!G56,NA())","v":{"$error":"#N/A"}},{"$f":"IF(funnelPivot!H56<>0,funnelPivot!H56,NA())","v":{"$error":"#N/A"}}]
[{"$f":"IF(funnelPivot!A57<>0,funnelPivot!A57,NA())","v":{"$error":"#N/A"}},{"$f":"IF(funnelPivot!B57<>0,funnelPivot!B57,NA())","v":{"$error":"#N/A"}},{"$f":"IF(funnelPivot!C57<>0,funnelPivot!C57,NA())","v":{"$error":"#N/A"}},{"$f":"IF(funnelPivot!D57<>0,funnelPivot!D57,NA())","v":{"$error":"#N/A"}},{"$f":"IF(funnelPivot!E57<>0,funnelPivot!E57,NA())","v":{"$error":"#N/A"}},{"$f":"IF(funnelPivot!F57<>0,funnelPivot!F57,NA())","v":{"$error":"#N/A"}},{"$f":"IF(funnelPivot!G57<>0,funnelPivot!G57,NA())","v":{"$error":"#N/A"}},{"$f":"IF(funnelPivot!H57<>0,funnelPivot!H57,NA())","v":{"$error":"#N/A"}}]

{"sheet":"barPivot","index":5,"n_rows":11,"n_cols":3,"rows_kept":11,"cut":false,"hidden":true,"merged":[]}
[]
[null,"Biennium","2018 and 2019"]
[null,"Peer group","Level 6"]
[null,"Indicator Name","NCMI: Caesarean section for selected females giving birth for the first time"]
[]
[null,"Row Labels","Sum of Fac rate"]
[null,"Gold Coast University Hospital",23.971321696]
[null,"Mater Mothers' Hospital",25.249258959999999]
[null,"Royal Brisbane and Women's",30.020080320999998]
[null,"Townsville",27.922077922]
[null,"Grand Total",107.16273889899999]

{"sheet":"Data","index":6,"n_rows":774,"n_cols":18,"rows_kept":774,"cut":false,"hidden":true,"merged":[]}
["Biennium","Peer group","Facility/Region","Mothers","Babies","Indicator Code","Indicator Name","Numerator","Denominator","Qld Numerator","Qld Denominator","Fac rate","Qld rate","Stardard Error","lcl95","ucl95","lcl99.7","ucl99.7"]
["2014 and 2015","Level 2/3 (300+ births)","Atherton",397,399,"NCMI_0500","NCMI: Induction of labour for selected females giving birth for the first time",23,92,799,3000,25,26.633333332999999,4.6085917976999999,17.600493409999999,35.666173256999997,12.807557940000001,40.459108725999997]
["2014 and 2015","Level 2/3 (300+ births)","Atherton",397,399,"NCMI_0500_A","Modified NCMI: Induction of labour for all females giving birth",66,397,2331,11401,16.624685139,20.445574950000001,2.0241215154000001,16.478296779000001,24.412853120000001,14.373210403,26.517939496]
["2014 and 2015","Level 2/3 (300+ births)","Atherton",397,399,"NCMI_0600","NCMI: Caesarean section for selected females giving birth for the first time",22,92,718,3000,23.913043477999999,23.933333333,4.4484106699000003,15.21444842,32.652218245999997,10.588101324,37.278565342999997]
["2014 and 2015","Level 2/3 (300+ births)","Atherton",397,399,"NCMI_0600_A","Modified NCMI: Caesarean section for all females giving birth",120,397,3108,11401,30.226700252000001,27.260766599,2.2349002221999998,22.880362164000001,31.641171034999999,20.556065932999999,33.965467265999997]
["2014 and 2015","Level 2/3 (300+ births)","Atherton",397,399,"NCMI_0700","NCMI: Non-instrumental vaginal birth for selected females giving birth for the first time",56,92,1807,3000,60.869565217000002,60.233333332999997,5.1025131157999999,50.232407625999997,70.234259039999998,44.925793986000002,75.540872680999996]
["2014 and 2015","Level 2/3 (300+ births)","Atherton",397,399,"NCMI_1500","NCMI: Females having their second birth vaginally whose first birth was by caesarean section",3,41,139,932,7.3170731706999996,14.914163090000001,5.5633470544000003,4.0100028635999996,25.818323317000001,-1.7758780729999999,31.604204252999999]
["2014 and 2015","Level 2/3 (300+ births)","Dalby",434,434,"NCMI_0500","NCMI: Induction of labour for selected females giving birth for the first time",33,100,799,3000,33,26.633333332999999,4.4204059643000004,17.969337642999999,35.297329023000003,13.372115441,39.894551225999997]
["2014 and 2015","Level 2/3 (300+ births)","Dalby",434,434,"NCMI_0500_A","Modified NCMI: Induction of labour for all females giving birth",88,434,2331,11401,20.276497696,20.445574950000001,1.9359180534,16.651175564999999,24.239974333999999,14.637820788999999,26.253329109999999]
["2014 and 2015","Level 2/3 (300+ births)","Dalby",434,434,"NCMI_0600","NCMI: Caesarean section for selected females giving birth for the first time",24,100,718,3000,24,23.933333333,4.2667656238999996,15.570472711000001,32.296193956000003,11.133036462,36.733630204999997]
["2014 and 2015","Level 2/3 (300+ births)","Dalby",434,434,"NCMI_0600_A","Modified NCMI: Caesarean section for all females giving birth",123,434,3108,11401,28.341013825000001,27.260766599,2.1375118315999999,23.071243409000001,31.450289788999999,20.848231105,33.673302094]
["2014 and 2015","Level 2/3 (300+ births)","Dalby",434,434,"NCMI_0700","NCMI: Non-instrumental vaginal birth for selected females giving birth for the first time",63,100,1807,3000,63,60.233333332999997,4.8941586496999996,50.640782379999997,69.825884286999994,45.550857383999997,74.915809283000002]
["2014 and 2015","Level 2/3 (300+ births)","Dalby",434,434,"NCMI_1500","NCMI: Females having their second birth vaginally whose first birth was by caesarean section",2,35,139,932,5.7142857142999999,14.914163090000001,6.0213525967999999,3.1123120003999998,26.716014179999998,-3.1498946999999999,32.978220880999999]
["2014 and 2015","Level 2/3 (300+ births)","Emerald",647,648,"NCMI_0500","NCMI: Induction of labour for selected females giving birth for the first time",56,189,799,3000,29.62962963,26.633333332999999,3.2153722117000001,20.331203798000001,32.935462868000002,16.987216698000001,36.279449968000002]
["2014 and 2015","Level 2/3 (300+ births)","Emerald",647,648,"NCMI_0500_A","Modified NCMI: Induction of labour for all females giving birth",142,647,2331,11401,21.947449767999998,20.445574950000001,1.5855490957,17.337898721999998,23.553251177,15.688927661999999,25.202222237000001]
["2014 and 2015","Level 2/3 (300+ births)","Emerald",647,648,"NCMI_0600","NCMI: Caesarean section for selected females giving birth for the first time",35,189,718,3000,18.518518519000001,23.933333333,3.1036153085999998,17.850247328999998,30.016419337999999,14.622487408,33.244179258999999]
["2014 and 2015","Level 2/3 (300+ births)","Emerald",647,648,"NCMI_0600_A","Modified NCMI: Caesarean section for all females giving birth",140,647,3108,11401,21.638330756999999,27.260766599,1.7506577541999999,23.829477400999998,30.692055797999998,22.008793337,32.512739861999997]
["2014 and 2015","Level 2/3 (300+ births)","Emerald",647,648,"NCMI_0700","NCMI: Non-instrumental vaginal birth for selected females giving birth for the first time",133,189,1807,3000,70.370370370000003,60.233333332999997,3.5599765834000001,53.255779230000002,67.210887436999997,49.553403582999998,70.913263083999993]
["2014 and 2015","Level 2/3 (300+ births)","Emerald",647,648,"NCMI_1500","NCMI: Females having their second birth vaginally whose first birth was by caesarean section",10,45,139,932,22.222222221999999,14.914163090000001,5.3103338425000004,4.5059087589000004,25.322417421000001,-1.0168384370000001,30.845164617999998]
["2014 and 2015","Level 2/3 (300+ births)","Gladstone",1089,1095,"NCMI_0500","NCMI: Induction of labour for selected females giving birth for the first time",54,331,799,3000,16.314199395999999,26.633333332999999,2.4296748560000001,21.871170616000001,31.395496050999999,19.344308765000001,33.922357900999998]
["2014 and 2015","Level 2/3 (300+ births)","Gladstone",1089,1095,"NCMI_0500_A","Modified NCMI: Induction of labour for all females giving birth",137,1089,2331,11401,12.580348944000001,20.445574950000001,1.2221313782000001,18.050197447999999,22.840952451,16.779180815,24.111969083999998]
["2014 and 2015","Level 2/3 (300+ births)","Gladstone",1089,1095,"NCMI_0600","NCMI: Caesarean section for selected females giving birth for the first time",76,331,718,3000,22.960725075999999,23.933333333,2.3452264875000002,19.336689417999999,28.529977249000002,16.897653870999999,30.969012796000001]
["2014 and 2015","Level 2/3 (300+ births)","Gladstone",1089,1095,"NCMI_0600_A","Modified NCMI: Caesarean section for all females giving birth",260,1089,3108,11401,23.875114784000001,27.260766599,1.3493961049000001,24.615950234,29.905582965000001,23.212578284999999,31.308954914000001]
["2014 and 2015","Level 2/3 (300+ births)","Gladstone",1089,1095,"NCMI_0700","NCMI: Non-instrumental vaginal birth for selected females giving birth for the first time",196,331,1807,3000,59.214501511000002,60.233333332999997,2.6900728822,54.960790484,65.505876181999994,52.163114686999997,68.303551979999995]
["2014 and 2015","Level 2/3 (300+ births)","Gladstone",1089,1095,"NCMI_1500","NCMI: Females having their second birth vaginally whose first birth was by caesarean section",14,81,139,932,17.283950616999999,14.914163090000001,3.9580891516999999,7.1563083529,22.672017827000001,3.0398956351000002,26.788430545000001]
["2014 and 2015","Level 2/3 (300+ births)","Gympie",686,686,"NCMI_0500","NCMI: Induction of labour for selected females giving birth for the first time",26,153,799,3000,16.993464052,26.633333332999999,3.5736864115000002,19.628907967,33.637758699999999,15.912274098999999,37.354392568000002]
["2014 and 2015","Level 2/3 (300+ births)","Gympie",686,686,"NCMI_0500_A","Modified NCMI: Induction of labour for all females giving birth",99,686,2331,11401,14.43148688,20.445574950000001,1.5398193639,17.427528995999999,23.463620902999999,15.826116858000001,25.065033041]
["2014 and 2015","Level 2/3 (300+ births)","Gympie",686,686,"NCMI_0600","NCMI: Caesarean section for selected females giving birth for the first time",30,153,718,3000,19.607843137,23.933333333,3.4494755582000001,17.172361239000001,30.694305427,13.584906659,34.281760007999999]
["2014 and 2015","Level 2/3 (300+ births)","Gympie",686,686,"NCMI_0600_A","Modified NCMI: Caesarean section for all females giving birth",184,686,3108,11401,26.822157434000001,27.260766599,1.7001660287,23.928441183,30.593092016,22.160268512999998,32.361264685999998]
["2014 and 2015","Level 2/3 (300+ births)","Gympie",686,686,"NCMI_0700","NCMI: Non-instrumental vaginal birth for selected females giving birth for the first time",98,153,1807,3000,64.052287582000005,60.233333332999997,3.9566927570999999,52.478215529000003,67.988451136999998,48.363255062,72.103411605000005]
["2014 and 2015","Level 2/3 (300+ births)","Innisfail",399,399,"NCMI_0500","NCMI: Induction of labour for selected females giving birth for the first time",20,90,799,3000,22.222222221999999,26.633333332999999,4.6595170099000001,17.500679993999999,35.765986673,12.654782303999999,40.611884363000001]
["2014 and 2015","Level 2/3 (300+ births)","Innisfail",399,399,"NCMI_0500_A","Modified NCMI: Induction of labour for all females giving birth",69,399,2331,11401,17.293233083000001,20.445574950000001,2.0190421560999998,16.488252324000001,24.402897575000001,14.388448480999999,26.502701418000001]
["2014 and 2015","Level 2/3 (300+ births)","Innisfail",399,399,"NCMI_0600","NCMI: Caesarean section for selected females giving birth for the first time",24,90,718,3000,26.666666667000001,23.933333333,4.4975658712,15.118104226,32.748562440999997,10.44063572,37.426030947000001]
["2014 and 2015","Level 2/3 (300+ births)","Innisfail",399,399,"NCMI_0600_A","Modified NCMI: Caesarean section for all females giving birth",99,399,3108,11401,24.812030074999999,27.260766599,2.2292919318000002,22.891354412999998,31.630178785999998,20.572890804,33.948642395]
["2014 and 2015","Level 2/3 (300+ births)","Innisfail",399,399,"NCMI_0700","NCMI: Non-instrumental vaginal birth for selected females giving birth for the first time",55,90,1807,3000,61.111111111,60.233333332999997,5.1588961877999999,50.121896804999999,70.344769861000003,44.756644770000001,75.710021897000004]
["2014 and 2015","Level 2/3 (300+ births)","Innisfail",399,399,"NCMI_1500","NCMI: Females having their second birth vaginally whose first birth was by caesarean section",2,25,139,932,8,14.914163090000001,7.1245604729999998,0.95002456310000005,28.878301617000002,-6.4595183289999998,36.287844509000003]
["2014 and 2015","Level 2/3 (300+ births)","Kingaroy",753,760,"NCMI_0500","NCMI: Induction of labour for selected females giving birth for the first time",39,125,799,3000,31.2,26.633333332999999,3.9537312896999999,18.884020006,34.382646661000003,14.772139464,38.494527202]
["2014 and 2015","Level 2/3 (300+ births)","Kingaroy",753,760,"NCMI_0500_A","Modified NCMI: Induction of labour for all females giving birth",165,753,2331,11401,21.912350598,20.445574950000001,1.4697191283,17.564925458000001,23.326224441000001,16.036417565000001,24.854732334000001]
["2014 and 2015","Level 2/3 (300+ births)","Kingaroy",753,760,"NCMI_0600","NCMI: Caesarean section for selected females giving birth for the first time",46,125,718,3000,36.799999999999997,23.933333333,3.8163111916000001,16.453363398,31.413303269,12.484399759,35.382266907999998]
["2014 and 2015","Level 2/3 (300+ births)","Kingaroy",753,760,"NCMI_0600_A","Modified NCMI: Caesarean section for all females giving birth",210,753,3108,11401,27.888446214999998,27.260766599,1.6227660155000001,24.080145209000001,30.441387989999999,22.392468553,32.129064646000003]
["2014 and 2015","Level 2/3 (300+ births)","Kingaroy",753,760,"NCMI_0700","NCMI: Non-instrumental vaginal birth for selected females giving birth for the first time",61,125,1807,3000,48.8,60.233333332999997,4.3774685733999998,51.653494928999997,68.813171737000005,47.100927613000003,73.365739054000002]
["2014 and 2015","Level 2/3 (300+ births)","Kingaroy",753,760,"NCMI_1500","NCMI: Females having their second birth vaginally whose first birth was by caesarean section",13,52,139,932,25,14.914163090000001,4.9399938655,5.2317751138000004,24.596551066,9.4181493699999994E-2,29.734144687000001]
["2014 and 2015","Level 2/3 (300+ births)","Mareeba",423,424,"NCMI_0500","NCMI: Induction of labour for selected females giving birth for the first time",14,126,799,3000,11.111111111,26.633333332999999,3.9380106259000001,18.914832507,34.351834160000003,14.819301456,38.447365210999997]
["2014 and 2015","Level 2/3 (300+ births)","Mareeba",423,424,"NCMI_0500_A","Modified NCMI: Induction of labour for all females giving birth",35,423,2331,11401,8.2742316784999996,20.445574950000001,1.9609280140000001,16.602156042000001,24.288993857000001,14.562790908,26.328358991000002]
["2014 and 2015","Level 2/3 (300+ births)","Mareeba",423,424,"NCMI_0600","NCMI: Caesarean section for selected females giving birth for the first time",16,126,718,3000,12.698412698,23.933333333,3.8011369318999999,16.483104947000001,31.383561719999999,12.529922537999999,35.336744129000003]
["2014 and 2015","Level 2/3 (300+ births)","Mareeba",423,424,"NCMI_0600_A","Modified NCMI: Caesarean section for all females giving birth",66,423,3108,11401,15.602836879,27.260766599,2.1651261650000002,23.017119315999999,31.504413883000002,20.765388103999999,33.756145095000001]
["2014 and 2015","Level 2/3 (300+ births)","Mareeba",423,424,"NCMI_0700","NCMI: Non-instrumental vaginal birth for selected females giving birth for the first time",101,126,1807,3000,80.158730159000001,60.233333332999997,4.3600630628000001,51.687609729999998,68.779056936000003,47.153144144999999,73.313522522]
["2014 and 2015","Level 2/3 (300+ births)","Mareeba",423,424,"NCMI_1500","NCMI: Females having their second birth vaginally whose first birth was by caesarean section",6,24,139,932,25,14.914163090000001,7.2714740835000002,0.66207388639999998,29.166252294,-6.9002591600000001,36.728585340999999]
["2014 and 2015","Level 2/3 (300+ births)","Proserpine",495,495,"NCMI_0500","NCMI: Induction of labour for selected females giving birth for the first time",37,160,799,3000,23.125,26.633333332999999,3.4946377574,19.783843329,33.482823338000003,16.149420061000001,37.117246606000002]
["2014 and 2015","Level 2/3 (300+ births)","Proserpine",495,495,"NCMI_0500_A","Modified NCMI: Induction of labour for all females giving birth",102,495,2331,11401,20.606060606,20.445574950000001,1.8127137756,16.892655949000002,23.99849395,15.007433623000001,25.883716276000001]
["2014 and 2015","Level 2/3 (300+ births)","Proserpine",495,495,"NCMI_0600","NCMI: Caesarean section for selected females giving birth for the first time",39,160,718,3000,24.375,23.933333333,3.3731744034000002,17.321911502999999,30.544755164000001,13.813810123,34.052856542999997]
["2014 and 2015","Level 2/3 (300+ births)","Proserpine",495,495,"NCMI_0600_A","Modified NCMI: Caesarean section for all females giving birth",150,495,3108,11401,30.303030303,27.260766599,2.0014778703,23.337869974,31.183663225,21.256332988,33.265200210000003]
["2014 and 2015","Level 2/3 (300+ births)","Proserpine",495,495,"NCMI_0700","NCMI: Non-instrumental vaginal birth for selected females giving birth for the first time",98,160,1807,3000,61.25,60.233333332999997,3.8691721408999999,52.649755937000002,67.816910729,48.625816911000001,71.840849755999997]
["2014 and 2015","Level 2/3 (300+ births)","Proserpine",495,495,"NCMI_1500","NCMI: Females having their second birth vaginally whose first birth was by caesarean section",5,46,139,932,10.869565217,14.914163090000001,5.2522956644000001,4.6196635878999999,25.208662592,-0.842723903,30.671050083000001]
["2014 and 2015","Level 2/3 (300+ births)","Redland",3644,3675,"NCMI_0500","NCMI: Induction of labour for selected females giving birth for the first time",340,1026,799,3000,33.138401559000002,26.633333332999999,1.3800298359000001,23.928474855000001,29.338191812000002,22.493243826,30.773422840999999]
["2014 and 2015","Level 2/3 (300+ births)","Redland",3644,3675,"NCMI_0500_A","Modified NCMI: Induction of labour for all females giving birth",967,3644,2331,11401,26.536772776999999,20.445574950000001,0.66810181329999996,19.136095396000002,21.755054504,18.441269510000001,22.449880389]
["2014 and 2015","Level 2/3 (300+ births)","Redland",3644,3675,"NCMI_0600","NCMI: Caesarean section for selected females giving birth for the first time",275,1026,718,3000,26.803118907999998,23.933333333,1.3320640481999999,21.322487799000001,26.544178867999999,19.937141188999998,27.929525477999999]
["2014 and 2015","Level 2/3 (300+ births)","Redland",3644,3675,"NCMI_0600_A","Modified NCMI: Caesarean section for all females giving birth",1138,3644,3108,11401,31.229418222,27.260766599,0.73767354360000004,25.814926453999998,28.706606744999998,25.047745969000001,29.473787229999999]
["2014 and 2015","Level 2/3 (300+ births)","Redland",3644,3675,"NCMI_0700","NCMI: Non-instrumental vaginal birth for selected females giving birth for the first time",567,1026,1807,3000,55.263157894999999,60.233333332999997,1.5279331837000001,57.238584293000002,63.228082372999999,55.649533781999999,64.817132884000003]
["2014 and 2015","Level 2/3 (300+ births)","Redland",3644,3675,"NCMI_1500","NCMI: Females having their second birth vaginally whose first birth was by caesarean section",64,353,139,932,18.130311615,14.914163090000001,1.8960104591,11.197982590000001,18.630343589999999,9.2261317128000009,20.602194467]
["2014 and 2015","Level 2/3 (300+ births)","Roma",312,312,"NCMI_0500","NCMI: Induction of labour for selected females giving birth for the first time",23,98,799,3000,23.469387755,26.633333332999999,4.4652843327999996,17.881376040999999,35.385290626,13.237480335000001,40.029186332000002]
["2014 and 2015","Level 2/3 (300+ births)","Roma",312,312,"NCMI_0500_A","Modified NCMI: Induction of labour for all females giving birth",47,312,2331,11401,15.064102564000001,20.445574950000001,2.2832556321999999,15.970393911,24.920755989,13.595808053000001,27.295341845999999]
["2014 and 2015","Level 2/3 (300+ births)","Roma",312,312,"NCMI_0600","NCMI: Caesarean section for selected females giving birth for the first time",29,98,718,3000,29.591836735000001,23.933333333,4.3100841518999999,15.485568396,32.381098270999999,11.003080878,36.863585788999998]
["2014 and 2015","Level 2/3 (300+ births)","Roma",312,312,"NCMI_0600_A","Modified NCMI: Caesarean section for all females giving birth",108,312,3108,11401,34.615384615000004,27.260766599,2.5210188622,22.319569629,32.201963569,19.697710012999998,34.823823185999998]
["2014 and 2015","Level 2/3 (300+ births)","Roma",312,312,"NCMI_0700","NCMI: Non-instrumental vaginal birth for selected females giving birth for the first time",45,98,1807,3000,45.918367347,60.233333332999997,4.9438468135000004,50.543393579000004,69.923273088000002,45.401792893,75.064873774000006]
["2014 and 2015","Level 2/3 (300+ births)","Roma",312,312,"NCMI_1500","NCMI: Females having their second birth vaginally whose first birth was by caesarean section",5,31,139,932,16.129032257999999,14.914163090000001,6.3980441778000001,2.3739965016000002,27.454329679000001,-4.2799694429999997,34.108295624]
["2014 and 2015","Level 2/3 (300+ births)","Warwick",390,392,"NCMI_0500","NCMI: Induction of labour for selected females giving birth for the first time",19,90,799,3000,21.111111111,26.633333332999999,4.6595170099000001,17.500679993999999,35.765986673,12.654782303999999,40.611884363000001]
["2014 and 2015","Level 2/3 (300+ births)","Warwick",390,392,"NCMI_0500_A","Modified NCMI: Induction of labour for all females giving birth",53,390,2331,11401,13.589743589999999,20.445574950000001,2.0422059213999999,16.442851344000001,24.448298556000001,14.318957185,26.572192714]
["2014 and 2015","Level 2/3 (300+ births)","Warwick",390,392,"NCMI_0600","NCMI: Caesarean section for selected females giving birth for the first time",16,90,718,3000,17.777777778000001,23.933333333,4.4975658712,15.118104226,32.748562440999997,10.44063572,37.426030947000001]
["2014 and 2015","Level 2/3 (300+ births)","Warwick",390,392,"NCMI_0600_A","Modified NCMI: Caesarean section for all females giving birth",89,390,3108,11401,22.820512821000001,27.260766599,2.2548678193999998,22.841225673,31.680307525,20.496163141,34.025370058]
["2014 and 2015","Level 2/3 (300+ births)","Warwick",390,392,"NCMI_0700","NCMI: Non-instrumental vaginal birth for selected females giving birth for the first time",58,90,1807,3000,64.444444443999998,60.233333332999997,5.1588961877999999,50.121896804999999,70.344769861000003,44.756644770000001,75.710021897000004]
["2014 and 2015","Level 2/3 (300+ births)","Warwick",390,392,"NCMI_1500","NCMI: Females having their second birth vaginally whose first birth was by caesarean section",1,24,139,932,4.1666666667000003,14.914163090000001,7.2714740835000002,0.66207388639999998,29.166252294,-6.9002591600000001,36.728585340999999]
["2014 and 2015","Level 2/3 (<300 births)","Ayr",242,243,"NCMI_0500","NCMI: Induction of labour for selected females giving birth for the first time",15,60,799,3000,25,26.633333332999999,5.7067195609999999,15.448162994,37.818503673000002,9.5131746502999999,43.753492016000003]
["2014 and 2015","Level 2/3 (<300 births)","Ayr",242,243,"NCMI_0500_A","Modified NCMI: Induction of labour for all females giving birth",44,242,2331,11401,18.181818182000001,20.445574950000001,2.5925321549999998,15.364211925999999,25.526937972999999,12.667978484000001,28.223171414999999]
["2014 and 2015","Level 2/3 (<300 births)","Ayr",242,243,"NCMI_0600","NCMI: Caesarean section for selected females giving birth for the first time",18,60,718,3000,30,23.933333333,5.5083707344999997,13.136926694,34.729739973000001,7.4082211300000003,40.458445537000003]
["2014 and 2015","Level 2/3 (<300 births)","Ayr",242,243,"NCMI_0600_A","Modified NCMI: Caesarean section for all females giving birth",85,242,3108,11401,35.123966942000003,27.260766599,2.8625014088,21.650263838000001,32.871269361000003,18.673262373,35.848270825999997]
["2014 and 2015","Level 2/3 (<300 births)","Ayr",242,243,"NCMI_0700","NCMI: Non-instrumental vaginal birth for selected females giving birth for the first time",37,60,1807,3000,61.666666667000001,60.233333332999997,6.3183316481,47.849403303000003,72.617263363999996,41.278338388999998,79.188328276999997]
["2014 and 2015","Level 2/3 (<300 births)","Ayr",242,243,"NCMI_1500","NCMI: Females having their second birth vaginally whose first birth was by caesarean section",2,27,139,932,7.4074074074,14.914163090000001,6.8556115116000003,1.4771645275,28.351161652999998,-5.6526714450000002,35.480997625000001]
["2014 and 2015","Level 2/3 (<300 births)","Biloela",151,151,"NCMI_0500","NCMI: Induction of labour for selected females giving birth for the first time",14,50,799,3000,28,26.633333332999999,6.2513980659000001,14.380593124000001,38.886073541999998,7.8791391358,45.387527531000003]
["2014 and 2015","Level 2/3 (<300 births)","Biloela",151,151,"NCMI_0500_A","Modified NCMI: Induction of labour for all females giving birth",30,151,2331,11401,19.867549668999999,20.445574950000001,3.2820361552000001,14.012784085,26.878365813999999,10.599466484000001,30.291683415000001]
["2014 and 2015","Level 2/3 (<300 births)","Biloela",151,151,"NCMI_0600","NCMI: Caesarean section for selected females giving birth for the first time",8,50,718,3000,16,23.933333333,6.0341178126999999,12.10646242,35.760204246000001,5.8309798951999996,42.035686771000002]
["2014 and 2015","Level 2/3 (<300 births)","Biloela",151,151,"NCMI_0600_A","Modified NCMI: Caesarean section for all females giving birth",27,151,3108,11401,17.880794701999999,27.260766599,3.6238058224,20.158107187999999,34.363426011000001,16.389349132,38.132184066000001]
["2014 and 2015","Level 2/3 (<300 births)","Biloela",151,151,"NCMI_0700","NCMI: Non-instrumental vaginal birth for selected females giving birth for the first time",39,50,1807,3000,78,60.233333332999997,6.9213855389000001,46.667417677000003,73.799248989999995,39.469176717000003,80.997489950000002]
["2014 and 2015","Level 2/3 (<300 births)","Charleville",100,100,"NCMI_0500","NCMI: Induction of labour for selected females giving birth for the first time",8,33,799,3000,24.242424241999998,26.633333332999999,7.6949390862999998,11.551252723999999,41.715413943000001,3.5485160744000002,49.718150592000001]
["2014 and 2015","Level 2/3 (<300 births)","Charleville",100,100,"NCMI_0500_A","Modified NCMI: Induction of labour for all females giving birth",17,100,2331,11401,17,20.445574950000001,4.0330335479999997,12.540829195000001,28.350320704000001,8.3464743054999992,32.544675593999997]
["2014 and 2015","Level 2/3 (<300 births)","Charleville",100,100,"NCMI_0600","NCMI: Caesarean section for selected females giving birth for the first time",7,33,718,3000,21.212121212,23.933333333,7.4274855831000002,9.3754615904000005,38.491205076,1.6508765839999999,46.215790083000002]
["2014 and 2015","Level 2/3 (<300 births)","Charleville",100,100,"NCMI_0600_A","Modified NCMI: Caesarean section for all females giving birth",17,100,3108,11401,17,27.260766599,4.4530071461,18.532872593,35.988660606000003,13.901745160999999,40.619788038000003]
["2014 and 2015","Level 2/3 (<300 births)","Charleville",100,100,"NCMI_0700","NCMI: Non-instrumental vaginal birth for selected females giving birth for the first time",25,33,1807,3000,75.757575758000002,60.233333332999997,8.5196366561999994,43.534845486999998,76.93182118,34.674423365000003,85.792243302000003]
["2014 and 2015","Level 2/3 (<300 births)","Chinchilla",65,65,"NCMI_0500","NCMI: Induction of labour for selected females giving birth for the first time",5,17,799,3000,29.411764706,26.633333332999999,10.721059235,5.6200572335999999,47.646609433000002,-5.5298443700000002,58.796511037000002]
["2014 and 2015","Level 2/3 (<300 births)","Chinchilla",65,65,"NCMI_0500_A","Modified NCMI: Induction of labour for all females giving birth",11,65,2331,11401,16.923076923,20.445574950000001,5.0023624572000003,10.640944534000001,30.250205365999999,5.4384875781000002,35.452662320999998]
["2014 and 2015","Level 2/3 (<300 births)","Chinchilla",65,65,"NCMI_0600","NCMI: Caesarean section for selected females giving birth for the first time",4,17,718,3000,23.529411764999999,23.933333333,10.348426675000001,3.6504170509999998,44.216249615999999,-7.111946691,54.978613357]
["2014 and 2015","Level 2/3 (<300 births)","Chinchilla",65,65,"NCMI_0600_A","Modified NCMI: Caesarean section for all females giving birth",18,65,3108,11401,27.692307692,27.260766599,5.5232755949000003,16.435146433,38.086386765999997,10.690939815,43.830593383999997]
["2014 and 2015","Level 2/3 (<300 births)","Chinchilla",65,65,"NCMI_0700","NCMI: Non-instrumental vaginal birth for selected females giving birth for the first time",10,17,1807,3000,58.823529411999999,60.233333332999997,11.870078271000001,36.967979921000001,83.498686745000001,24.623098518999999,95.843568148000003]
["2014 and 2015","Level 2/3 (<300 births)","Goondiwindi",201,201,"NCMI_0500","NCMI: Induction of labour for selected females giving birth for the first time",12,48,799,3000,25,26.633333332999999,6.3803064335000004,14.127932724000001,39.138733942999998,7.4924140329000002,45.774252634]
["2014 and 2015","Level 2/3 (<300 births)","Goondiwindi",201,201,"NCMI_0500_A","Modified NCMI: Induction of labour for all females giving birth",43,201,2331,11401,21.393034826000001,20.445574950000001,2.8446825317000002,14.869997186999999,26.021152711999999,11.911527354,28.979622545000002]
["2014 and 2015","Level 2/3 (<300 births)","Goondiwindi",201,201,"NCMI_0600","NCMI: Caesarean section for selected females giving birth for the first time",13,48,718,3000,27.083333332999999,23.933333333,6.1585457037999998,11.862583753999999,36.004082912999998,5.4576962221,42.408970445000001]
["2014 and 2015","Level 2/3 (<300 births)","Goondiwindi",201,201,"NCMI_0600_A","Modified NCMI: Caesarean section for all females giving birth",52,201,3108,11401,25.870646766,27.260766599,3.1409090679,21.104584826,33.416948372999997,17.838039395999999,36.683493802999998]
["2014 and 2015","Level 2/3 (<300 births)","Goondiwindi",201,201,"NCMI_0700","NCMI: Non-instrumental vaginal birth for selected females giving birth for the first time",28,48,1807,3000,58.333333332999999,60.233333332999997,7.0641095347,46.387678645000001,74.078988021000001,39.041004729000001,81.425661937000001]
["2014 and 2015","Level 2/3 (<300 births)","Goondiwindi",201,201,"NCMI_1500","NCMI: Females having their second birth vaginally whose first birth was by caesarean section",1,16,139,932,6.25,14.914163090000001,8.9057005912000005,-2.5410100689999999,32.369336249,-11.80293868,41.631264864000002]
["2014 and 2015","Level 2/3 (<300 births)","Longreach",187,187,"NCMI_0500","NCMI: Induction of labour for selected females giving birth for the first time",7,44,799,3000,15.909090909,26.633333332999999,6.6640127293000004,13.571868384,39.694798282999997,6.6412951454,46.625371520999998]
["2014 and 2015","Level 2/3 (<300 births)","Longreach",187,187,"NCMI_0500_A","Modified NCMI: Induction of labour for all females giving birth",37,187,2331,11401,19.786096257000001,20.445574950000001,2.9492462192,14.665052360000001,26.226097539000001,11.597836292,29.293313607000002]
["2014 and 2015","Level 2/3 (<300 births)","Longreach",187,187,"NCMI_0600","NCMI: Caesarean section for selected females giving birth for the first time",6,44,718,3000,13.636363636,23.933333333,6.4323912011999997,11.325846579,36.540820087999997,4.6361597296000001,43.230506937000001]
["2014 and 2015","Level 2/3 (<300 births)","Longreach",187,187,"NCMI_0600_A","Modified NCMI: Caesarean section for all females giving birth",51,187,3108,11401,27.272727273000001,27.260766599,3.2563613303999999,20.878298392000001,33.643234806999999,17.491682608000001,37.029850590999999]
["2014 and 2015","Level 2/3 (<300 births)","Longreach",187,187,"NCMI_0700","NCMI: Non-instrumental vaginal birth for selected females giving birth for the first time",27,44,1807,3000,61.363636364000001,60.233333332999997,7.3782217753000001,45.772018654,74.694648013000005,38.098668007000001,82.367998658999994]
["2014 and 2015","Level 2/3 (<300 births)","Longreach",187,187,"NCMI_1500","NCMI: Females having their second birth vaginally whose first birth was by caesarean section",2,20,139,932,10,14.914163090000001,7.9655007636999997,-0.69821840700000004,30.526544587,-8.9823392010000003,38.810665381]
["2014 and 2015","Level 2/3 (<300 births)","Mount Isa",147,151,"NCMI_0500","NCMI: Induction of labour for selected females giving birth for the first time",18,36,799,3000,50,26.633333332999999,7.3673432738000004,12.193340516999999,41.07332615,4.531303512,48.735363155000002]
["2014 and 2015","Level 2/3 (<300 births)","Mount Isa",147,151,"NCMI_0500_A","Modified NCMI: Induction of labour for all females giving birth",58,147,2331,11401,39.455782313,20.445574950000001,3.3263900066000001,13.925850537000001,26.965299362,10.466404929999999,30.424744968999999]
["2014 and 2015","Level 2/3 (<300 births)","Mount Isa",147,151,"NCMI_0600","NCMI: Caesarean section for selected females giving birth for the first time",3,36,718,3000,8.3333333333000006,23.933333333,7.1112760397999999,9.9952322953999992,37.871434370999999,2.5995052141000001,45.267161453]
["2014 and 2015","Level 2/3 (<300 births)","Mount Isa",147,151,"NCMI_0600_A","Modified NCMI: Caesarean section for all females giving birth",36,147,3108,11401,24.489795917999999,27.260766599,3.6727783922000001,20.062120951000001,34.459412248,16.242431422999999,38.279101775999997]
["2014 and 2015","Level 2/3 (<300 births)","Mount Isa",147,151,"NCMI_0700","NCMI: Non-instrumental vaginal birth for selected females giving birth for the first time",24,36,1807,3000,66.666666667000001,60.233333332999997,8.1569310828999999,44.245748411000001,76.220918256000004,35.762540084999998,84.704126582000001]
["2014 and 2015","Level 2/3 (<300 births)","Mount Isa",147,151,"NCMI_1500","NCMI: Females having their second birth vaginally whose first birth was by caesarean section",3,8,139,932,37.5,14.914163090000001,12.594562559,-9.7711795250000009,39.599505704999999,-22.869524590000001,52.697850766000002]
["2014 and 2015","Level 2/3 (<300 births)","St George",103,103,"NCMI_0500","NCMI: Induction of labour for selected females giving birth for the first time",4,22,799,3000,18.181818182000001,26.633333332999999,9.4243371816000003,8.1616324572999996,45.105034209000003,-1.639678212,54.906344877999999]
["2014 and 2015","Level 2/3 (<300 births)","St George",103,103,"NCMI_0500_A","Modified NCMI: Induction of labour for all females giving birth",23,103,2331,11401,22.330097086999999,20.445574950000001,3.9738660346999999,12.656797522,28.234352378000001,8.5239768455,32.367173053999998]
["2014 and 2015","Level 2/3 (<300 births)","St George",103,103,"NCMI_0600","NCMI: Caesarean section for selected females giving birth for the first time",8,22,718,3000,36.363636364000001,23.933333333,9.0967748752999995,6.1036545778000004,41.763012089,-3.356991292,51.223657959000001]
["2014 and 2015","Level 2/3 (<300 births)","St George",103,103,"NCMI_0600_A","Modified NCMI: Caesarean section for all females giving birth",33,103,3108,11401,32.038834950999998,27.260766599,4.3876783169999998,18.660917097999999,35.860616100999998,14.097731649,40.42380155]
["2014 and 2015","Level 2/3 (<300 births)","St George",103,103,"NCMI_0700","NCMI: Non-instrumental vaginal birth for selected females giving birth for the first time",11,22,1807,3000,50,60.233333332999997,10.434381301,39.781945983999996,80.684720682999995,28.930189430999999,91.536477235999996]
["2014 and 2015","Level 2/3 (<300 births)","Stanthorpe",251,252,"NCMI_0500","NCMI: Induction of labour for selected females giving birth for the first time",27,73,799,3000,36.98630137,26.633333332999999,5.1736938513000004,16.492893384999999,36.773773282000001,11.112251778999999,42.154414887000001]
["2014 and 2015","Level 2/3 (<300 births)","Stanthorpe",251,252,"NCMI_0500_A","Modified NCMI: Induction of labour for all females giving birth",63,251,2331,11401,25.099601593999999,20.445574950000001,2.5456282030000001,15.456143672,25.435006226999999,12.808690341,28.082459559]
["2014 and 2015","Level 2/3 (<300 births)","Stanthorpe",251,252,"NCMI_0600","NCMI: Caesarean section for selected females giving birth for the first time",11,73,718,3000,15.068493151,23.933333333,4.9938714342999999,14.145345322000001,33.721321345,8.9517190303999996,38.914947636000001]
["2014 and 2015","Level 2/3 (<300 births)","Stanthorpe",251,252,"NCMI_0600_A","Modified NCMI: Caesarean section for all females giving birth",58,251,3108,11401,23.107569721000001,27.260766599,2.8107131876000002,21.751768752,32.769764447,18.828627037,35.692906162]
["2014 and 2015","Level 2/3 (<300 births)","Stanthorpe",251,252,"NCMI_0700","NCMI: Non-instrumental vaginal birth for selected females giving birth for the first time",48,73,1807,3000,65.753424658,60.233333332999997,5.7281794292999999,49.006101651999998,71.460565015,43.048795046000002,77.417871621000003]
["2014 and 2015","Level 2/3 (<300 births)","Stanthorpe",251,252,"NCMI_1500","NCMI: Females having their second birth vaginally whose first birth was by caesarean section",1,21,139,932,4.7619047619000003,14.914163090000001,7.7735327763999997,-0.32196115199999997,30.150287332000001,-8.4064352390000003,38.234761419000002]
["2014 and 2015","Level 2/3 (<300 births)","Thursday Island",257,257,"NCMI_0500","NCMI: Induction of labour for selected females giving birth for the first time",5,36,799,3000,13.888888889,26.633333332999999,7.3673432738000004,12.193340516999999,41.07332615,4.531303512,48.735363155000002]
["2014 and 2015","Level 2/3 (<300 births)","Thursday Island",257,257,"NCMI_0500_A","Modified NCMI: Induction of labour for all females giving birth",35,257,2331,11401,13.618677043,20.445574950000001,2.5157372072999999,15.514730023,25.376419876,12.898363328,27.992786572]
["2014 and 2015","Level 2/3 (<300 births)","Thursday Island",257,257,"NCMI_0600","NCMI: Caesarean section for selected females giving birth for the first time",8,36,718,3000,22.222222221999999,23.933333333,7.1112760397999999,9.9952322953999992,37.871434370999999,2.5995052141000001,45.267161453]
["2014 and 2015","Level 2/3 (<300 births)","Thursday Island",257,257,"NCMI_0600_A","Modified NCMI: Caesarean section for all females giving birth",44,257,3108,11401,17.120622568000002,27.260766599,2.7777095401,21.816455901000001,32.705077297999999,18.927637979,35.59389522]
["2014 and 2015","Level 2/3 (<300 births)","Thursday Island",257,257,"NCMI_0700","NCMI: Non-instrumental vaginal birth for selected females giving birth for the first time",27,36,1807,3000,75,60.233333332999997,8.1569310828999999,44.245748411000001,76.220918256000004,35.762540084999998,84.704126582000001]
["2014 and 2015","Level 2/3 (<300 births)","Thursday Island",257,257,"NCMI_1500","NCMI: Females having their second birth vaginally whose first birth was by caesarean section",2,10,139,932,20,14.914163090000001,11.264919211,-7.1650785639999999,36.993404744000003,-18.880594540000001,48.708920724000002]
["2014 and 2015","Level 4/5","Bundaberg",2145,2168,"NCMI_0500","NCMI: Induction of labour for selected females giving birth for the first time",130,513,3361,10530,25.341130604,31.918328585000001,2.0581474850000001,27.884359514,35.952297655999999,25.74388613,38.092771040000002]
["2014 and 2015","Level 4/5","Bundaberg",2145,2168,"NCMI_0500_A","Modified NCMI: Induction of labour for all females giving birth",451,2145,10827,42949,21.025641025999999,25.208968776999999,0.93753751029999999,23.371395257,27.046542296999998,22.396356246,28.021581307999998]
["2014 and 2015","Level 4/5","Bundaberg",2145,2168,"NCMI_0600","NCMI: Caesarean section for selected females giving birth for the first time",152,513,2432,10530,29.62962963,23.095916428999999,1.8607311058,19.448883462000001,26.742949397,17.513723112000001,28.678109747000001]
["2014 and 2015","Level 4/5","Bundaberg",2145,2168,"NCMI_0600_A","Modified NCMI: Caesarean section for all females giving birth",690,2145,11833,42949,32.167832167999997,27.551281753000001,0.96465630899999999,25.660555386999999,29.442008118,24.657312825999998,30.445250680000001]
["2014 and 2015","Level 4/5","Bundaberg",2145,2168,"NCMI_0700","NCMI: Non-instrumental vaginal birth for selected females giving birth for the first time",289,513,5983,10530,56.335282651,56.818613485,2.1869302143999998,52.532230265000003,61.104996704999998,50.257822842000003,63.379404127999997]
["2014 and 2015","Level 4/5","Bundaberg",2145,2168,"NCMI_1500","NCMI: Females having their second birth vaginally whose first birth was by caesarean section",24,173,627,3357,13.872832369999999,18.677390527,2.9630617423999999,12.869789512000001,24.484991541999999,9.7882053000999996,27.566575753999999]
["2014 and 2015","Level 4/5","Caboolture",3922,3967,"NCMI_0500","NCMI: Induction of labour for selected females giving birth for the first time",295,889,3361,10530,33.183352081000002,31.918328585000001,1.5634510725999999,28.853964482999999,34.982692686999997,27.227975366999999,36.608681803000003]
["2014 and 2015","Level 4/5","Caboolture",3922,3967,"NCMI_0500_A","Modified NCMI: Induction of labour for all females giving birth",1027,3922,10827,42949,26.185619582000001,25.208968776999999,0.69334359219999997,23.850015335999998,26.567922218,23.128938000000002,27.288999553]
["2014 and 2015","Level 4/5","Caboolture",3922,3967,"NCMI_0600","NCMI: Caesarean section for selected females giving birth for the first time",196,889,2432,10530,22.047244094,23.095916428999999,1.4134857022,20.325484453000001,25.866348406,18.855459323000002,27.336373536]
["2014 and 2015","Level 4/5","Caboolture",3922,3967,"NCMI_0600_A","Modified NCMI: Caesarean section for all females giving birth",1054,3922,11833,42949,26.874043855,27.551281753000001,0.71339894469999998,26.153019821000001,28.949543683999998,25.411084919,29.691478586999999]
["2014 and 2015","Level 4/5","Caboolture",3922,3967,"NCMI_0700","NCMI: Non-instrumental vaginal birth for selected females giving birth for the first time",526,889,5983,10530,59.167604048999998,56.818613485,1.6612795799,53.562505508999998,60.074721461999999,51.834774746000001,61.802452225000003]
["2014 and 2015","Level 4/5","Caboolture",3922,3967,"NCMI_1500","NCMI: Females having their second birth vaginally whose first birth was by caesarean section",99,351,627,3357,28.205128205000001,18.677390527,2.0802244398999998,14.600150624999999,22.754630428999999,12.436717207999999,24.918063846999999]
["2014 and 2015","Level 4/5","Cairns",4759,4826,"NCMI_0500","NCMI: Induction of labour for selected females giving birth for the first time",371,1173,3361,10530,31.628303495000001,31.918328585000001,1.3610878876000001,29.250596325,34.586060844999999,27.835064922000001,36.001592248000001]
["2014 and 2015","Level 4/5","Cairns",4759,4826,"NCMI_0500_A","Modified NCMI: Induction of labour for all females giving birth",1167,4759,10827,42949,24.521958394999999,25.208968776999999,0.62942566649999998,23.975294471000002,26.442643083,23.320691777,27.097245776000001]
["2014 and 2015","Level 4/5","Cairns",4759,4826,"NCMI_0600","NCMI: Caesarean section for selected females giving birth for the first time",326,1173,2432,10530,27.791986359999999,23.095916428999999,1.2305330831000001,20.684071586000002,25.507761272,19.40431718,26.787515677999998]
["2014 and 2015","Level 4/5","Cairns",4759,4826,"NCMI_0600_A","Modified NCMI: Caesarean section for all females giving birth",1505,4759,11833,42949,31.624290816999999,27.551281753000001,0.6476321572,26.281922725000001,28.820640781000002,25.608385281,29.494178223999999]
["2014 and 2015","Level 4/5","Cairns",4759,4826,"NCMI_0700","NCMI: Non-instrumental vaginal birth for selected females giving birth for the first time",625,1173,5983,10530,53.282182438,56.818613485,1.4462540937999999,53.983955461000001,59.653271509,52.479851203999999,61.157375766999998]
["2014 and 2015","Level 4/5","Cairns",4759,4826,"NCMI_1500","NCMI: Females having their second birth vaginally whose first birth was by caesarean section",49,354,627,3357,13.84180791,18.677390527,2.0713911752,14.617463824,22.737317230999999,12.463217002,24.891564053]
["2014 and 2015","Level 4/5","Hervey Bay",1890,1915,"NCMI_0500","NCMI: Induction of labour for selected females giving birth for the first time",165,447,3361,10530,36.912751677999999,31.918328585000001,2.2048620053999999,27.596799054000002,36.239858116000001,25.303742569000001,38.532914601000002]
["2014 and 2015","Level 4/5","Hervey Bay",1890,1915,"NCMI_0500_A","Modified NCMI: Induction of labour for all females giving birth",497,1890,10827,42949,26.296296296000001,25.208968776999999,0.99878359110000003,23.251352938,27.166584615000001,22.212618003999999,28.205319549999999]
["2014 and 2015","Level 4/5","Hervey Bay",1890,1915,"NCMI_0600","NCMI: Caesarean section for selected females giving birth for the first time",89,447,2432,10530,19.910514541000001,23.095916428999999,1.9933728498000001,19.188905643999998,27.002927215,17.115797879999999,29.076034978999999]
["2014 and 2015","Level 4/5","Hervey Bay",1890,1915,"NCMI_0600_A","Modified NCMI: Caesarean section for all females giving birth",470,1890,11833,42949,24.867724868,27.551281753000001,1.0276739670999999,25.537040777000001,29.565522728000001,24.468259851999999,30.634303654]
["2014 and 2015","Level 4/5","Hervey Bay",1890,1915,"NCMI_0700","NCMI: Non-instrumental vaginal birth for selected females giving birth for the first time",252,447,5983,10530,56.375838926,56.818613485,2.3428249789,52.226676527000002,61.410550444000002,49.790138548999998,63.847088421999999]
["2014 and 2015","Level 4/5","Hervey Bay",1890,1915,"NCMI_1500","NCMI: Females having their second birth vaginally whose first birth was by caesarean section",24,143,627,3357,16.783216783,18.677390527,3.2590853491999998,12.289583242999999,25.065197812000001,8.9001344796000001,28.454646575000002]
["2014 and 2015","Level 4/5","Ipswich",5403,5468,"NCMI_0500","NCMI: Induction of labour for selected females giving birth for the first time",377,1229,3361,10530,30.67534581,31.918328585000001,1.3297170388999999,29.312083188999999,34.524573981000003,27.929177467999999,35.907479702000003]
["2014 and 2015","Level 4/5","Ipswich",5403,5468,"NCMI_0500_A","Modified NCMI: Induction of labour for all females giving birth",1292,5403,10827,42949,23.912641125,25.208968776999999,0.59072427380000003,24.051149200000001,26.366788354000001,23.436795955000001,26.981141598000001]
["2014 and 2015","Level 4/5","Ipswich",5403,5468,"NCMI_0600","NCMI: Caesarean section for selected females giving birth for the first time",232,1229,2432,10530,18.877135883000001,23.095916428999999,1.2021713089999999,20.739660663999999,25.452172194999999,19.489402502000001,26.702430356000001]
["2014 and 2015","Level 4/5","Ipswich",5403,5468,"NCMI_0600_A","Modified NCMI: Caesarean section for all females giving birth",1289,5403,11833,42949,23.857116417,27.551281753000001,0.60781130500000002,26.359971595000001,28.742591911000002,25.727847837999999,29.374715668]
["2014 and 2015","Level 4/5","Ipswich",5403,5468,"NCMI_0700","NCMI: Non-instrumental vaginal birth for selected females giving birth for the first time",752,1229,5983,10530,61.187957689000001,56.818613485,1.4129203034,54.049289690999998,59.587937279999998,52.579852574999997,61.057374394999997]
["2014 and 2015","Level 4/5","Ipswich",5403,5468,"NCMI_1500","NCMI: Females having their second birth vaginally whose first birth was by caesarean section",66,365,627,3357,18.082191780999999,18.677390527,2.0399396552,14.679108803,22.675672251000002,12.557571562,24.797209493]
["2014 and 2015","Level 4/5","Logan",6537,6621,"NCMI_0500","NCMI: Induction of labour for selected females giving birth for the first time",538,1492,3361,10530,36.058981232999997,31.918328585000001,1.2068429664,29.552916370999998,34.283740799,28.297799686000001,35.538857483999998]
["2014 and 2015","Level 4/5","Logan",6537,6621,"NCMI_0500_A","Modified NCMI: Induction of labour for all females giving birth",1810,6537,10827,42949,27.688542145,25.208968776999999,0.53704794410000001,24.156354807,26.261582746999999,23.597824944999999,26.820112608999999]
["2014 and 2015","Level 4/5","Logan",6537,6621,"NCMI_0600","NCMI: Caesarean section for selected females giving birth for the first time",401,1492,2432,10530,26.876675602999999,23.095916428999999,1.0910832503000001,20.957393259,25.234439600000002,19.822666678000001,26.369166180000001]
["2014 and 2015","Level 4/5","Logan",6537,6621,"NCMI_0600_A","Modified NCMI: Caesarean section for all females giving birth",1891,6537,11833,42949,28.927642649999999,27.551281753000001,0.55258235730000005,26.468220332000001,28.634343173000001,25.893534680999998,29.209028825000001]
["2014 and 2015","Level 4/5","Logan",6537,6621,"NCMI_0700","NCMI: Non-instrumental vaginal birth for selected females giving birth for the first time",760,1492,5983,10530,50.938337801999999,56.818613485,1.2823577351,54.305192325,59.332034645999997,52.971540279999999,60.665686690000001]
["2014 and 2015","Level 4/5","Logan",6537,6621,"NCMI_1500","NCMI: Females having their second birth vaginally whose first birth was by caesarean section",104,472,627,3357,22.033898305000001,18.677390527,1.7938773789,15.161390865,22.193390189999999,13.295758391,24.059022664]
["2014 and 2015","Level 4/5","Mackay",2668,2694,"NCMI_0500","NCMI: Induction of labour for selected females giving birth for the first time",281,744,3361,10530,37.768817204000001,31.918328585000001,1.7090261481,28.568637334999998,35.268019834999997,26.791250140999999,37.045407029000003]
["2014 and 2015","Level 4/5","Mackay",2668,2694,"NCMI_0500_A","Modified NCMI: Induction of labour for all females giving birth",828,2668,10827,42949,31.034482758999999,25.208968776999999,0.84063871690000003,23.561316892000001,26.856620662000001,22.687052626,27.730884927999998]
["2014 and 2015","Level 4/5","Mackay",2668,2694,"NCMI_0600","NCMI: Caesarean section for selected females giving birth for the first time",153,744,2432,10530,20.564516129000001,23.095916428999999,1.5450972962,20.067525729,26.124307129999998,18.460624541000001,27.731208318]
["2014 and 2015","Level 4/5","Mackay",2668,2694,"NCMI_0600_A","Modified NCMI: Caesarean section for all females giving birth",694,2668,11833,42949,26.011994003000002,27.551281753000001,0.86495466359999995,25.855970612,29.246592892999999,24.956417762000001,30.146145743999998]
["2014 and 2015","Level 4/5","Mackay",2668,2694,"NCMI_0700","NCMI: Non-instrumental vaginal birth for selected females giving birth for the first time",415,744,5983,10530,55.779569891999998,56.818613485,1.8159636020000001,53.259324825,60.377902145,51.370722678999996,62.266504290999997]
["2014 and 2015","Level 4/5","Mackay",2668,2694,"NCMI_1500","NCMI: Females having their second birth vaginally whose first birth was by caesarean section",24,197,627,3357,12.182741117000001,18.677390527,2.7767107370000002,13.235037482999999,24.119743572000001,10.347258316,27.007522737999999]
["2014 and 2015","Level 4/5","Mount Isa",858,868,"NCMI_0500","NCMI: Induction of labour for selected females giving birth for the first time",79,212,3361,10530,37.264150942999997,31.918328585000001,3.2016012789000001,25.643190078,38.193467091999999,22.313524747999999,41.523132422000003]
["2014 and 2015","Level 4/5","Mount Isa",858,868,"NCMI_0500_A","Modified NCMI: Induction of labour for all females giving birth",251,858,10827,42949,29.254079254000001,25.208968776999999,1.4823769622,22.303509931000001,28.114427623000001,20.761837889999999,29.656099662999999]
["2014 and 2015","Level 4/5","Mount Isa",858,868,"NCMI_0600","NCMI: Caesarean section for selected females giving birth for the first time",37,212,2432,10530,17.452830189,23.095916428999999,2.8945054383,17.422685770000001,28.769147088,14.412400114,31.779432744000001]
["2014 and 2015","Level 4/5","Mount Isa",858,868,"NCMI_0600_A","Modified NCMI: Caesarean section for all females giving birth",230,858,11833,42949,26.806526807000001,27.551281753000001,1.5252555478000001,24.561780879000001,30.540782625999999,22.975515109,32.127048395999999]
["2014 and 2015","Level 4/5","Mount Isa",858,868,"NCMI_0700","NCMI: Non-instrumental vaginal birth for selected females giving birth for the first time",126,212,5983,10530,59.433962264000002,56.818613485,3.4019323796999998,50.150826021,63.486400949,46.612816346000002,67.024410623999998]
["2014 and 2015","Level 4/5","Mount Isa",858,868,"NCMI_1500","NCMI: Females having their second birth vaginally whose first birth was by caesarean section",18,85,627,3357,21.176470588000001,18.677390527,4.2272145408000004,10.392050027,26.962731027,5.9957469046999998,31.359034149999999]
["2014 and 2015","Level 4/5","Nambour",4913,4989,"NCMI_0500","NCMI: Induction of labour for selected females giving birth for the first time",428,1479,3361,10530,28.938471941,31.918328585000001,1.2121352700000001,29.542543456000001,34.294113713999998,28.281922775000002,35.554734394999997]
["2014 and 2015","Level 4/5","Nambour",4913,4989,"NCMI_0500_A","Modified NCMI: Induction of labour for all females giving birth",1214,4913,10827,42949,24.709953185,25.208968776999999,0.61948232380000001,23.994783422000001,26.423154132000001,23.350521806,27.067415747999998]
["2014 and 2015","Level 4/5","Nambour",4913,4989,"NCMI_0600","NCMI: Caesarean section for selected females giving birth for the first time",266,1479,2432,10530,17.985125085,23.095916428999999,1.0958679189,20.948015307999999,25.243817549999999,19.808312672,26.383520185999998]
["2014 and 2015","Level 4/5","Nambour",4913,4989,"NCMI_0600_A","Modified NCMI: Caesarean section for all females giving birth",1153,4913,11833,42949,23.468349277000002,27.551281753000001,0.63740119770000003,26.301975405,28.800588099999999,25.63907816,29.463485345999999]
["2014 and 2015","Level 4/5","Nambour",4913,4989,"NCMI_0700","NCMI: Non-instrumental vaginal birth for selected females giving birth for the first time",854,1479,5983,10530,57.741717377000001,56.818613485,1.2879811895,54.294170354000002,59.343056617000002,52.954669916999997,60.682557054]
["2014 and 2015","Level 4/5","Nambour",4913,4989,"NCMI_1500","NCMI: Females having their second birth vaginally whose first birth was by caesarean section",103,398,627,3357,25.879396985,18.677390527,1.9535395886,14.848452934000001,22.506328120999999,12.816771762,24.538009293000002]
["2014 and 2015","Level 4/5","Redcliffe",3300,3329,"NCMI_0500","NCMI: Induction of labour for selected females giving birth for the first time",245,818,3361,10530,29.951100243999999,31.918328585000001,1.6298908565000001,28.723742506000001,35.112914664000002,27.028656015999999,36.808001154000003]
["2014 and 2015","Level 4/5","Redcliffe",3300,3329,"NCMI_0500_A","Modified NCMI: Induction of labour for all females giving birth",778,3300,10827,42949,23.575757576000001,25.208968776999999,0.75586690570000004,23.727469641999999,26.690467911999999,22.941368059999999,27.476569494]
["2014 and 2015","Level 4/5","Redcliffe",3300,3329,"NCMI_0600","NCMI: Caesarean section for selected females giving birth for the first time",214,818,2432,10530,26.161369192999999,23.095916428999999,1.4735526184000001,20.207753297,25.984079561000001,18.675258574000001,27.516574285000001]
["2014 and 2015","Level 4/5","Redcliffe",3300,3329,"NCMI_0600_A","Modified NCMI: Caesarean section for all females giving birth",984,3300,11833,42949,29.818181817999999,27.551281753000001,0.77773078009999996,26.026929423999999,29.075634082000001,25.218089412000001,29.884474093000001]
["2014 and 2015","Level 4/5","Redcliffe",3300,3329,"NCMI_0700","NCMI: Non-instrumental vaginal birth for selected females giving birth for the first time",456,818,5983,10530,55.745721271000001,56.818613485,1.7318766445,53.424135262,60.213091708,51.622983552000001,62.014243419000003]
["2014 and 2015","Level 4/5","Redcliffe",3300,3329,"NCMI_1500","NCMI: Females having their second birth vaginally whose first birth was by caesarean section",41,296,627,3357,13.851351351,18.677390527,2.2652591700000002,14.237482554,23.117298501,11.881613016999999,25.473168037000001]
["2014 and 2015","Level 4/5","Rockhampton",2660,2694,"NCMI_0500","NCMI: Induction of labour for selected females giving birth for the first time",228,633,3361,10530,36.018957346000001,31.918328585000001,1.852820385,28.286800629999998,35.54985654,26.359867430000001,37.476789740000001]
["2014 and 2015","Level 4/5","Rockhampton",2660,2694,"NCMI_0500_A","Modified NCMI: Induction of labour for all females giving birth",657,2660,10827,42949,24.69924812,25.208968776999999,0.84190188619999995,23.558841080000001,26.859096474000001,22.683263117999999,27.734674435999999]
["2014 and 2015","Level 4/5","Rockhampton",2660,2694,"NCMI_0600","NCMI: Caesarean section for selected females giving birth for the first time",165,633,2432,10530,26.066350710999998,23.095916428999999,1.6750988686999999,19.812722647000001,26.379110212000001,18.070619823000001,28.121213035]
["2014 and 2015","Level 4/5","Rockhampton",2660,2694,"NCMI_0600_A","Modified NCMI: Caesarean section for all females giving birth",742,2660,11833,42949,27.894736842,27.551281753000001,0.86625437080000001,25.853423186000001,29.249140319999999,24.952518640000001,30.150044865000002]
["2014 and 2015","Level 4/5","Rockhampton",2660,2694,"NCMI_0700","NCMI: Non-instrumental vaginal birth for selected females giving birth for the first time",381,633,5983,10530,60.189573459999998,56.818613485,1.9687553546000001,52.959852990000002,60.677373979999999,50.912347421,62.724879549000001]
["2014 and 2015","Level 4/5","Rockhampton",2660,2694,"NCMI_1500","NCMI: Females having their second birth vaginally whose first birth was by caesarean section",23,197,627,3357,11.675126904000001,18.677390527,2.7767107370000002,13.235037482999999,24.119743572000001,10.347258316,27.007522737999999]
["2014 and 2015","Level 4/5","Toowoomba",3894,3937,"NCMI_0500","NCMI: Induction of labour for selected females giving birth for the first time",224,901,3361,10530,24.861265261,31.918328585000001,1.5530047346,28.874439304999999,34.962217865,27.259314380999999,36.577342788999999]
["2014 and 2015","Level 4/5","Toowoomba",3894,3937,"NCMI_0500_A","Modified NCMI: Induction of labour for all females giving birth",855,3894,10827,42949,21.956856703,25.208968776999999,0.69583188789999995,23.845138277,26.572799277000001,23.121473113,27.296464440000001]
["2014 and 2015","Level 4/5","Toowoomba",3894,3937,"NCMI_0600","NCMI: Caesarean section for selected females giving birth for the first time",201,901,2432,10530,22.308546060000001,23.095916428999999,1.4040413713,20.343995341999999,25.847837516999999,18.883792315000001,27.308040543000001]
["2014 and 2015","Level 4/5","Toowoomba",3894,3937,"NCMI_0600_A","Modified NCMI: Caesarean section for all females giving birth",1131,3894,11833,42949,29.044684129,27.551281753000001,0.71595921579999999,26.148001690000001,28.954561815999998,25.403404106,29.699159399999999]
["2014 and 2015","Level 4/5","Toowoomba",3894,3937,"NCMI_0700","NCMI: Non-instrumental vaginal birth for selected females giving birth for the first time",547,901,5983,10530,60.710321864999997,56.818613485,1.6501795921,53.584261484999999,60.052965485999998,51.868074708999998,61.769152261000002]
["2014 and 2015","Level 4/5","Toowoomba",3894,3937,"NCMI_1500","NCMI: Females having their second birth vaginally whose first birth was by caesarean section",52,326,627,3357,15.950920245000001,18.677390527,2.1585144117000001,14.44670228,22.908078774,12.201847292,25.152933762]
["2014 and 2015","Level 6","Gold Coast University Hospital",9316,9460,"NCMI_0500","NCMI: Induction of labour for selected females giving birth for the first time",1045,3002,3791,10854,34.810126582000002,34.927215773,0.87011435599999998,33.221791635000002,36.632639910999998,32.316872705000002,37.537558840999999]
["2014 and 2015","Level 6","Gold Coast University Hospital",9316,9460,"NCMI_0500_A","Modified NCMI: Induction of labour for all females giving birth",2597,9316,9477,34379,27.876771145999999,27.566246837000001,0.46296117840000001,26.658842926999998,28.473650746000001,26.177363302,28.955130371999999]
["2014 and 2015","Level 6","Gold Coast University Hospital",9316,9460,"NCMI_0600","NCMI: Caesarean section for selected females giving birth for the first time",497,3002,2389,10854,16.555629580000002,22.010318775999998,0.75618210379999995,20.528201852999999,23.492435700000001,19.741772465,24.278865088]
["2014 and 2015","Level 6","Gold Coast University Hospital",9316,9460,"NCMI_0600_A","Modified NCMI: Caesarean section for all females giving birth",2213,9316,9913,34379,23.754830398999999,28.834462898999998,0.46932756120000002,27.914580878999999,29.754344919000001,27.426480215000002,30.242445582999999]
["2014 and 2015","Level 6","Gold Coast University Hospital",9316,9460,"NCMI_0700","NCMI: Non-instrumental vaginal birth for selected females giving birth for the first time",1853,3002,5787,10854,61.725516321999997,53.316749584999997,0.91055677930000001,51.532058298000003,55.101440873000001,50.585079248,56.048419922999997]
["2014 and 2015","Level 6","Gold Coast University Hospital",9316,9460,"NCMI_1500","NCMI: Females having their second birth vaginally whose first birth was by caesarean section",163,678,568,2828,24.041297934999999,20.084865628999999,1.5386297851999999,17.069151250000001,23.100580008000001,15.468976273999999,24.700754985]
["2014 and 2015","Level 6","Mater Mothers' Hospital",11605,11842,"NCMI_0500","NCMI: Induction of labour for selected females giving birth for the first time",1490,3848,3791,10854,38.721413720999998,34.927215773,0.76853587739999996,33.420885452999997,36.433546092999997,32.621608141000003,37.232823404999998]
["2014 and 2015","Level 6","Mater Mothers' Hospital",11605,11842,"NCMI_0500_A","Modified NCMI: Induction of labour for all females giving birth",3530,11605,9477,34379,30.417923308999999,27.566246837000001,0.41479808460000001,26.753242590999999,28.379251083,26.321852582999998,28.810641091000001]
["2014 and 2015","Level 6","Mater Mothers' Hospital",11605,11842,"NCMI_0600","NCMI: Caesarean section for selected females giving birth for the first time",794,3848,2389,10854,20.634095634000001,22.010318775999998,0.6679042503,20.701226446,23.319411107000001,20.006606026,24.014031527]
["2014 and 2015","Level 6","Mater Mothers' Hospital",11605,11842,"NCMI_0600_A","Modified NCMI: Caesarean section for all females giving birth",3232,11605,9913,34379,27.850064626999998,28.834462898999998,0.42050215559999998,28.010278673999998,29.658647124000002,27.572956432000002,30.095969365999999]
["2014 and 2015","Level 6","Mater Mothers' Hospital",11605,11842,"NCMI_0700","NCMI: Non-instrumental vaginal birth for selected females giving birth for the first time",1970,3848,5787,10854,51.195426195000003,53.316749584999997,0.80425699049999999,51.740405883999998,54.893093286999999,50.903978614000003,55.729520557000001]
["2014 and 2015","Level 6","Mater Mothers' Hospital",11605,11842,"NCMI_1500","NCMI: Females having their second birth vaginally whose first birth was by caesarean section",235,999,568,2828,23.523523524000002,20.084865628999999,1.2675533231,17.600461116000002,22.569270143000001,16.282205659999999,23.887525599]
["2014 and 2015","Level 6","Royal Brisbane and Women's",8266,8480,"NCMI_0500","NCMI: Induction of labour for selected females giving birth for the first time",735,2641,3791,10854,27.830367285000001,34.927215773,0.92767847020000005,33.108965971000003,36.745465574999997,32.144180362,37.710251184000001]
["2014 and 2015","Level 6","Royal Brisbane and Women's",8266,8480,"NCMI_0500_A","Modified NCMI: Induction of labour for all females giving birth",1843,8266,9477,34379,22.296152916,27.566246837000001,0.49148652370000001,26.60293325,28.529560423,26.091787265000001,29.040706407999998]
["2014 and 2015","Level 6","Royal Brisbane and Women's",8266,8480,"NCMI_0600","NCMI: Caesarean section for selected females giving birth for the first time",741,2641,2389,10854,28.057553957,22.010318775999998,0.8062088073,20.430149514,23.590488039,19.591692353999999,24.428945199000001]
["2014 and 2015","Level 6","Royal Brisbane and Women's",8266,8480,"NCMI_0600_A","Modified NCMI: Caesarean section for all females giving birth",2953,8266,9913,34379,35.724655214000002,28.834462898999998,0.49824517109999999,27.857902363000001,29.811023433999999,27.339727385,30.329198412]
["2014 and 2015","Level 6","Royal Brisbane and Women's",8266,8480,"NCMI_0700","NCMI: Non-instrumental vaginal birth for selected females giving birth for the first time",1207,2641,5787,10854,45.702385460000002,53.316749584999997,0.97079644089999995,51.413988560999996,55.21951061,50.404360263000001,56.229138908000003]
["2014 and 2015","Level 6","Royal Brisbane and Women's",8266,8480,"NCMI_1500","NCMI: Females having their second birth vaginally whose first birth was by caesarean section",90,759,568,2828,11.857707509999999,20.084865628999999,1.4542132399000001,17.234607679,22.935123579999999,15.722225910000001,24.447505349]
["2014 and 2015","Level 6","Townsville",5192,5288,"NCMI_0500","NCMI: Induction of labour for selected females giving birth for the first time",521,1363,3791,10854,38.224504768999999,34.927215773,1.2913196216,32.396229314999999,37.458202231000001,31.053256908000002,38.801174637999999]
["2014 and 2015","Level 6","Townsville",5192,5288,"NCMI_0500_A","Modified NCMI: Induction of labour for all females giving birth",1507,5192,9477,34379,29.025423729,27.566246837000001,0.62014318130000001,26.350766200999999,28.781727472,25.705817292999999,29.426676381]
["2014 and 2015","Level 6","Townsville",5192,5288,"NCMI_0600","NCMI: Caesarean section for selected females giving birth for the first time",357,1363,2389,10854,26.192223037000002,22.010318775999998,1.1222350044,19.810738168,24.209899385,18.643613763000001,25.377023789999999]
["2014 and 2015","Level 6","Townsville",5192,5288,"NCMI_0600_A","Modified NCMI: Caesarean section for all females giving birth",1515,5192,9913,34379,29.179506933999999,28.834462898999998,0.62867104299999998,27.602267654999999,30.066658143000002,26.94844977,30.720476028]
["2014 and 2015","Level 6","Townsville",5192,5288,"NCMI_0700","NCMI: Non-instrumental vaginal birth for selected females giving birth for the first time",757,1363,5787,10854,55.539251651000001,53.316749584999997,1.3513394273999999,50.668124308000003,55.965374863000001,49.262731303000002,57.370767868000001]
["2014 and 2015","Level 6","Townsville",5192,5288,"NCMI_1500","NCMI: Females having their second birth vaginally whose first birth was by caesarean section",80,392,568,2828,20.408163264999999,20.084865628999999,2.0235127668000001,16.118780607000001,24.050950652000001,14.014327329,26.155403929999999]
["2014 and 2015","Queensland","Level 1",513,518,"NCMI_0500","NCMI: Induction of labour for selected females giving birth for the first time",22,112,11611,34695,19.642857143000001,33.465917279000003,4.4587635503999996,24.726740719999999,42.205093838000003,20.089626628000001,46.842207930000001]
["2014 and 2015","Queensland","Level 1",513,518,"NCMI_0500_A","Modified NCMI: Induction of labour for all females giving birth",62,513,32026,122586,12.085769981,26.125332419999999,1.9396349448000001,22.323647928,29.927016911999999,20.306427585000002,31.944237254000001]
["2014 and 2015","Queensland","Level 1",513,518,"NCMI_0600","NCMI: Caesarean section for selected females giving birth for the first time",25,112,9617,34695,22.321428570999998,27.718691453999998,4.2295128998999996,19.42884617,36.008536737999997,15.030152754,40.407230153999997]
["2014 and 2015","Queensland","Level 1",513,518,"NCMI_0600_A","Modified NCMI: Caesarean section for all females giving birth",76,513,41191,122586,14.814814815,33.601716346000003,2.0854533274999998,29.514227823999999,37.689204867999997,27.345356363,39.858076328999999]
["2014 and 2015","Queensland","Level 1",513,518,"NCMI_0700","NCMI: Non-instrumental vaginal birth for selected females giving birth for the first time",75,112,17278,34695,66.964285713999999,49.799682951000001,4.7245179961000003,40.539627678999999,59.059738224,35.626128962999999,63.97323694]
["2014 and 2015","Queensland","Level 1",513,518,"NCMI_1500","NCMI: Females having their second birth vaginally whose first birth was by caesarean section",1,22,1689,12492,4.5454545455000002,13.520653218,7.2902714076999997,-0.76827874100000004,27.809585176999999,-8.3501610050000004,35.391467441000003]
["2014 and 2015","Queensland","Level 2/3",11401,11457,"NCMI_0500","NCMI: Induction of labour for selected females giving birth for the first time",799,3000,11611,34695,26.633333332999999,33.465917279000003,0.86151496569999997,31.777347945999999,35.154486611999999,30.881372381999999,36.050462176000003]
["2014 and 2015","Queensland","Level 2/3",11401,11457,"NCMI_0500_A","Modified NCMI: Induction of labour for all females giving birth",2331,11401,32026,122586,20.445574950000001,26.125332419999999,0.41144066150000003,25.318908723,26.931756115999999,24.891010434999998,27.359654404]
["2014 and 2015","Queensland","Level 2/3",11401,11457,"NCMI_0600","NCMI: Caesarean section for selected females giving birth for the first time",718,3000,9617,34695,23.933333333,27.718691453999998,0.81721953179999995,26.116941172000001,29.320441735999999,25.267032859,30.17035005]
["2014 and 2015","Queensland","Level 2/3",11401,11457,"NCMI_0600_A","Modified NCMI: Caesarean section for all females giving birth",3108,11401,41191,122586,27.260766599,33.601716346000003,0.44237205509999999,32.734667117999997,34.468765574000003,32.274600180999997,34.928832511000003]
["2014 and 2015","Queensland","Level 2/3",11401,11457,"NCMI_0700","NCMI: Non-instrumental vaginal birth for selected females giving birth for the first time",1807,3000,17278,34695,60.233333332999997,49.799682951000001,0.91286360300000002,48.010470290000001,51.588895612999998,47.061092142,52.538273760000003]
["2014 and 2015","Queensland","Level 2/3",11401,11457,"NCMI_1500","NCMI: Females having their second birth vaginally whose first birth was by caesarean section",139,932,1689,12492,14.914163090000001,13.520653218,1.1200749410999999,11.325306333,15.716000103000001,10.160428395,16.880878040999999]
["2014 and 2015","Queensland","Level 4/5",42949,43476,"NCMI_0500","NCMI: Induction of labour for selected females giving birth for the first time",3361,10530,11611,34695,31.918328585000001,33.465917279000003,0.45984266979999999,32.564625646000003,34.367208912000002,32.086389269999998,34.845445288999997]
["2014 and 2015","Queensland","Level 4/5",42949,43476,"NCMI_0500_A","Modified NCMI: Induction of labour for all females giving birth",10827,42949,32026,122586,25.208968776999999,26.125332419999999,0.21198354680000001,25.709844667999999,26.540820171,25.489381778999999,26.76128306]
["2014 and 2015","Queensland","Level 4/5",42949,43476,"NCMI_0600","NCMI: Caesarean section for selected females giving birth for the first time",2432,10530,9617,34695,23.095916428999999,27.718691453999998,0.43619951629999998,26.863740402000001,28.573642505999999,26.410092904999999,29.027290003000001]
["2014 and 2015","Queensland","Level 4/5",42949,43476,"NCMI_0600_A","Modified NCMI: Caesarean section for all females giving birth",11833,42949,41191,122586,27.551281753000001,33.601716346000003,0.2279201012,33.154992948,34.048439744,32.917956042,34.28547665]
["2014 and 2015","Queensland","Level 4/5",42949,43476,"NCMI_0700","NCMI: Non-instrumental vaginal birth for selected females giving birth for the first time",5983,10530,17278,34695,56.818613485,49.799682951000001,0.48725054480000002,48.844671884,50.754694018999999,48.337931316999999,51.261434586]
["2014 and 2015","Queensland","Level 4/5",42949,43476,"NCMI_1500","NCMI: Females having their second birth vaginally whose first birth was by caesarean section",627,3357,1689,12492,18.677390527,13.520653218,0.59017304039999996,12.363914059000001,14.677392377,11.750134097,15.291172338999999]
["2014 and 2015","Queensland","Level 6",34379,35070,"NCMI_0500","NCMI: Induction of labour for selected females giving birth for the first time",3791,10854,11611,34695,34.927215773,33.465917279000003,0.45292734849999999,32.578179675999998,34.353654882000001,32.107135233999998,34.824699324999997]
["2014 and 2015","Queensland","Level 6",34379,35070,"NCMI_0500_A","Modified NCMI: Induction of labour for all females giving birth",9477,34379,32026,122586,27.566246837000001,26.125332419999999,0.2369365511,25.66093678,26.589728059999999,25.414522767000001,26.836142073000001]
["2014 and 2015","Queensland","Level 6",34379,35070,"NCMI_0600","NCMI: Caesarean section for selected females giving birth for the first time",2389,10854,9617,34695,22.010318775999998,27.718691453999998,0.42963975139999999,26.876597540999999,28.560785367000001,26.429772199999999,29.007610708000001]
["2014 and 2015","Queensland","Level 6",34379,35070,"NCMI_0600_A","Modified NCMI: Caesarean section for all females giving birth",9913,34379,41191,122586,28.834462898999998,33.601716346000003,0.25474902900000002,33.102408249,34.101024443,32.837469259000002,34.365963432999997]
["2014 and 2015","Queensland","Level 6",34379,35070,"NCMI_0700","NCMI: Non-instrumental vaginal birth for selected females giving birth for the first time",5787,10854,17278,34695,53.316749584999997,49.799682951000001,0.47992305149999998,48.859033771,50.740332131999999,48.359913796999997,51.239452106000002]
["2014 and 2015","Queensland","Level 6",34379,35070,"NCMI_1500","NCMI: Females having their second birth vaginally whose first birth was by caesarean section",568,2828,1689,12492,20.084865628999999,13.520653218,0.64300645789999999,12.260360561000001,14.780945876000001,11.591633844,15.449672592000001]
["2014 and 2015","Queensland","Private",33344,34032,"NCMI_0500","NCMI: Induction of labour for selected females giving birth for the first time",3638,10199,11611,34695,35.670163742,33.465917279000003,0.46724499460000002,32.550117090000001,34.381717467999998,32.064182295000002,34.867652262999997]
["2014 and 2015","Queensland","Private",33344,34032,"NCMI_0500_A","Modified NCMI: Induction of labour for all females giving birth",9329,33344,32026,122586,27.978047024999999,26.125332419999999,0.24058571309999999,25.653784422000001,26.596880417000001,25.403575279999998,26.847089559]
["2014 and 2015","Queensland","Private",33344,34032,"NCMI_0600","NCMI: Caesarean section for selected females giving birth for the first time",4053,10199,9617,34695,39.739190117,27.718691453999998,0.44322124499999999,26.849977813999999,28.587405094000001,26.389027719000001,29.048355188999999]
["2014 and 2015","Queensland","Private",33344,34032,"NCMI_0600_A","Modified NCMI: Caesarean section for all females giving birth",16261,33344,41191,122586,48.767394434000003,33.601716346000003,0.25867252870000002,33.094718190000002,34.108714501999998,32.825698760000002,34.377733931999998]
["2014 and 2015","Queensland","Private",33344,34032,"NCMI_0700","NCMI: Non-instrumental vaginal birth for selected females giving birth for the first time",3626,10199,17278,34695,35.552505148000002,49.799682951000001,0.49509406820000001,48.829298578,50.770067324999999,48.314400747000001,51.284965155999998]
["2014 and 2015","Queensland","Private",33344,34032,"NCMI_1500","NCMI: Females having their second birth vaginally whose first birth was by caesarean section",354,5353,1689,12492,6.6131141415999997,13.520653218,0.4673652472,12.604617334,14.436689103000001,12.118557475999999,14.92274896]
["2016 and 2017","Level 2/3 (300+ births)","Atherton",320,320,"NCMI_0500","NCMI: Induction of labour for selected females giving birth for the first time",30,92,693,2406,32.608695652000002,28.802992519,4.7212365664,19.549368849,38.056616189000003,14.63928282,42.966702218000002]
["2016 and 2017","Level 2/3 (300+ births)","Atherton",320,320,"NCMI_0500_A","Modified NCMI: Induction of labour for all females giving birth",63,320,2135,9099,19.6875,23.464116936,2.3689705767999998,18.820934605000001,28.107299265999998,16.357205206,30.571028666]
["2016 and 2017","Level 2/3 (300+ births)","Atherton",320,320,"NCMI_0600","NCMI: Caesarean section for selected females giving birth for the first time",17,92,525,2406,18.47826087,21.820448878000001,4.3061039822999998,13.380485072999999,30.260412682999998,8.9021369309999994,34.738760825]
["2016 and 2017","Level 2/3 (300+ births)","Atherton",320,320,"NCMI_0600_A","Modified NCMI: Caesarean section for all females giving birth",73,320,2201,9099,22.8125,24.18947137,2.3938832286,19.497460241999999,28.881482498,17.007821685,31.371121056]
["2016 and 2017","Level 2/3 (300+ births)","Atherton",320,320,"NCMI_0700","NCMI: Non-instrumental vaginal birth for selected females giving birth for the first time",62,92,1513,2406,67.391304348000006,62.884455527999997,5.0368110228000003,53.012305923,72.756605132999994,47.774022459000001,77.994888595999996]
["2016 and 2017","Level 2/3 (300+ births)","Atherton",320,320,"NCMI_1500","NCMI: Females having their second birth vaginally whose first birth was by caesarean section",1,21,84,615,4.7619047619000003,13.658536585,7.4938007296000002,-1.029312845,28.346386015,-8.8228656040000004,36.139938774000001]
["2016 and 2017","Level 2/3 (300+ births)","Beaudesert",352,352,"NCMI_0500","NCMI: Induction of labour for selected females giving birth for the first time",23,110,693,2406,20.909090909,28.802992519,4.3177086450999997,20.340283574000001,37.265701462999999,15.849866583000001,41.756118454000003]
["2016 and 2017","Level 2/3 (300+ births)","Beaudesert",352,352,"NCMI_0500_A","Modified NCMI: Induction of labour for all females giving birth",61,352,2135,9099,17.329545455000002,23.464116936,2.2587248199999999,19.037016289,27.891217583,16.687942476,30.240291396]
["2016 and 2017","Level 2/3 (300+ births)","Beaudesert",352,352,"NCMI_0600","NCMI: Caesarean section for selected females giving birth for the first time",23,110,525,2406,20.909090909,21.820448878000001,3.9380577798999998,14.101855628999999,29.539042125999998,10.006275538000001,33.634622217]
["2016 and 2017","Level 2/3 (300+ births)","Beaudesert",352,352,"NCMI_0600_A","Modified NCMI: Caesarean section for all females giving birth",73,352,2201,9099,20.738636364000001,24.18947137,2.2824781015000002,19.715814292000001,28.663128448999998,17.342037066,31.036905675]
["2016 and 2017","Level 2/3 (300+ births)","Beaudesert",352,352,"NCMI_0700","NCMI: Non-instrumental vaginal birth for selected females giving birth for the first time",72,110,1513,2406,65.454545455000002,62.884455527999997,4.6063106966999996,53.856086562000002,71.912824493000002,49.065523438,76.703387617999994]
["2016 and 2017","Level 2/3 (300+ births)","Dalby",374,374,"NCMI_0500","NCMI: Induction of labour for selected females giving birth for the first time",24,106,693,2406,22.641509434,28.802992519,4.3984204646,20.182088407999998,37.423896628999998,15.607731125000001,41.998253912000003]
["2016 and 2017","Level 2/3 (300+ births)","Dalby",374,374,"NCMI_0500_A","Modified NCMI: Induction of labour for all females giving birth",83,374,2135,9099,22.192513369,23.464116936,2.191284944,19.169198445999999,27.759035426000001,16.890262104000001,30.037971767999998]
["2016 and 2017","Level 2/3 (300+ births)","Dalby",374,374,"NCMI_0600","NCMI: Caesarean section for selected females giving birth for the first time",27,106,525,2406,25.471698112999999,21.820448878000001,4.0116727072999998,13.957570370999999,29.683327383999998,9.7854307558000002,33.855466999999997]
["2016 and 2017","Level 2/3 (300+ births)","Dalby",374,374,"NCMI_0600_A","Modified NCMI: Caesarean section for all females giving birth",96,374,2201,9099,25.668449198000001,24.18947137,2.2143290118999999,19.849386506999998,28.529556234000001,17.546484334999999,30.832458406000001]
["2016 and 2017","Level 2/3 (300+ births)","Dalby",374,374,"NCMI_0700","NCMI: Non-instrumental vaginal birth for selected females giving birth for the first time",64,106,1513,2406,60.377358491000003,62.884455527999997,4.6924174139000003,53.687317397000001,72.081593659000006,48.807203285999996,76.961707770000004]
["2016 and 2017","Level 2/3 (300+ births)","Dalby",374,374,"NCMI_1500","NCMI: Females having their second birth vaginally whose first birth was by caesarean section",3,24,84,615,12.5,13.658536585,7.0098087138,-8.0688493999999999E-2,27.397761664000001,-7.3708895559999998,34.687962726999999]
["2016 and 2017","Level 2/3 (300+ births)","Emerald",581,582,"NCMI_0500","NCMI: Induction of labour for selected females giving birth for the first time",52,158,693,2406,32.911392405000001,28.802992519,3.6026422035999999,21.741813799999999,35.864171237999997,17.995065908000001,39.610919129000003]
["2016 and 2017","Level 2/3 (300+ births)","Emerald",581,582,"NCMI_0500_A","Modified NCMI: Induction of labour for all females giving birth",146,581,2135,9099,25.129087779999999,23.464116936,1.7581122083,20.018217008000001,26.910016863999999,18.189780311,28.738453561]
["2016 and 2017","Level 2/3 (300+ births)","Emerald",581,582,"NCMI_0600","NCMI: Caesarean section for selected females giving birth for the first time",32,158,525,2406,20.253164557000002,21.820448878000001,3.2858662601000002,15.380151008,28.260746747999999,11.962850097,31.678047658000001]
["2016 and 2017","Level 2/3 (300+ births)","Emerald",581,582,"NCMI_0600_A","Modified NCMI: Caesarean section for all females giving birth",128,581,2201,9099,22.030981066999999,24.18947137,1.7766009298000001,20.707333548000001,27.671609192999998,18.859668581000001,29.519274159999998]
["2016 and 2017","Level 2/3 (300+ births)","Emerald",581,582,"NCMI_0700","NCMI: Non-instrumental vaginal birth for selected females giving birth for the first time",103,158,1513,2406,65.189873418000005,62.884455527999997,3.8434481532999998,55.351297146999997,70.417613908000007,51.354111068000002,74.414799987999999]
["2016 and 2017","Level 2/3 (300+ births)","Emerald",581,582,"NCMI_1500","NCMI: Females having their second birth vaginally whose first birth was by caesarean section",5,39,84,615,12.820512820999999,13.658536585,5.4989463719999998,2.8806016961999998,24.436471474000001,-2.8383025310000001,30.155375701000001]
["2016 and 2017","Level 2/3 (300+ births)","Gladstone",1111,1119,"NCMI_0500","NCMI: Induction of labour for selected females giving birth for the first time",97,326,693,2406,29.754601226999998,28.802992519,2.5080770589000001,23.887161483,33.718823553999997,21.278761341999999,36.327223695000001]
["2016 and 2017","Level 2/3 (300+ births)","Gladstone",1111,1119,"NCMI_0500_A","Modified NCMI: Induction of labour for all females giving birth",248,1111,2135,9099,22.322232223,23.464116936,1.2713865901000001,20.972199219,25.956034652,19.649957166,27.278276706]
["2016 and 2017","Level 2/3 (300+ births)","Gladstone",1111,1119,"NCMI_0600","NCMI: Caesarean section for selected females giving birth for the first time",61,326,525,2406,18.711656441999999,21.820448878000001,2.2875448962,17.336860881,26.304036874000001,14.957814189,28.683083566000001]
["2016 and 2017","Level 2/3 (300+ births)","Gladstone",1111,1119,"NCMI_0600_A","Modified NCMI: Caesarean section for all females giving birth",248,1111,2201,9099,22.322232223,24.18947137,1.2847567904999999,21.671348061,26.70759468,20.335200999000001,28.043741742000002]
["2016 and 2017","Level 2/3 (300+ births)","Gladstone",1111,1119,"NCMI_0700","NCMI: Non-instrumental vaginal birth for selected females giving birth for the first time",209,326,1513,2406,64.110429448000005,62.884455527999997,2.6757206504000002,57.640043052999999,68.128868002999994,54.857293577,70.911617479]
["2016 and 2017","Level 2/3 (300+ births)","Gladstone",1111,1119,"NCMI_1500","NCMI: Females having their second birth vaginally whose first birth was by caesarean section",12,74,84,615,16.216216215999999,13.658536585,3.9920495936,5.8341193818999999,21.482953789,1.6823878045,25.634685365999999]
["2016 and 2017","Level 2/3 (300+ births)","Gympie",667,668,"NCMI_0500","NCMI: Induction of labour for selected females giving birth for the first time",49,169,693,2406,28.994082840000001,28.802992519,3.4834238698000002,21.975481733999999,35.630503304000001,18.352720908999999,39.253264127999998]
["2016 and 2017","Level 2/3 (300+ births)","Gympie",667,668,"NCMI_0500_A","Modified NCMI: Induction of labour for all females giving birth",143,667,2135,9099,21.439280360000001,23.464116936,1.6408607962999999,20.248029774999999,26.680204097000001,18.541534547000001,28.386699324999999]
["2016 and 2017","Level 2/3 (300+ births)","Gympie",667,668,"NCMI_0600","NCMI: Caesarean section for selected females giving birth for the first time",43,169,525,2406,25.443786981999999,21.820448878000001,3.1771306493,15.593272805,28.047624951,12.289056929999999,31.351840826]
["2016 and 2017","Level 2/3 (300+ births)","Gympie",667,668,"NCMI_0600_A","Modified NCMI: Caesarean section for all females giving birth",176,667,2201,9099,26.386806597,24.18947137,1.6581164744000001,20.939563080999999,27.43937966,19.215121947,29.163820793999999]
["2016 and 2017","Level 2/3 (300+ births)","Gympie",667,668,"NCMI_0700","NCMI: Non-instrumental vaginal birth for selected females giving birth for the first time",94,169,1513,2406,55.621301774999999,62.884455527999997,3.7162610893000001,55.600583792999998,70.168327262999995,51.735672260000001,74.033238796000006]
["2016 and 2017","Level 2/3 (300+ births)","Gympie",667,668,"NCMI_1500","NCMI: Females having their second birth vaginally whose first birth was by caesarean section",1,39,84,615,2.5641025641000001,13.658536585,5.4989463719999998,2.8806016961999998,24.436471474000001,-2.8383025310000001,30.155375701000001]
["2016 and 2017","Level 2/3 (300+ births)","Innisfail",447,448,"NCMI_0500","NCMI: Induction of labour for selected females giving birth for the first time",18,127,693,2406,14.173228346,28.802992519,4.0183504998000004,20.927025538999999,36.678959497999998,16.747941018999999,40.858044018000001]
["2016 and 2017","Level 2/3 (300+ births)","Innisfail",447,448,"NCMI_0500_A","Modified NCMI: Induction of labour for all females giving birth",58,447,2135,9099,12.975391499000001,23.464116936,2.0043838476000002,19.535524594999998,27.392709277000002,17.450965393000001,29.477268478999999]
["2016 and 2017","Level 2/3 (300+ births)","Innisfail",447,448,"NCMI_0600","NCMI: Caesarean section for selected females giving birth for the first time",26,127,525,2406,20.472440944999999,21.820448878000001,3.6650218318999999,14.637006087,29.003891668000001,10.825383382,32.815514372999999]
["2016 and 2017","Level 2/3 (300+ births)","Innisfail",447,448,"NCMI_0600_A","Modified NCMI: Caesarean section for all females giving birth",102,447,2201,9099,22.818791946000001,24.18947137,2.0254624196000002,20.219565028000002,28.159377713000001,18.113084111999999,30.265858629]
["2016 and 2017","Level 2/3 (300+ births)","Innisfail",447,448,"NCMI_0700","NCMI: Non-instrumental vaginal birth for selected females giving birth for the first time",82,127,1513,2406,64.566929134000006,62.884455527999997,4.2869430086999998,54.482047231000003,71.286863824999998,50.023626501999999,75.745284553999994]
["2016 and 2017","Level 2/3 (300+ births)","Innisfail",447,448,"NCMI_1500","NCMI: Females having their second birth vaginally whose first birth was by caesarean section",1,28,84,615,3.5714285713999998,13.658536585,6.4898218027999999,0.93848585200000001,26.378587319000001,-5.8109288230000002,33.128001994000002]
["2016 and 2017","Level 2/3 (300+ births)","Kingaroy",678,681,"NCMI_0500","NCMI: Induction of labour for selected females giving birth for the first time",39,143,693,2406,27.272727273000001,28.802992519,3.7868809922,21.380705773999999,36.225279262999997,17.442349541999999,40.163635495000001]
["2016 and 2017","Level 2/3 (300+ births)","Kingaroy",678,681,"NCMI_0500_A","Modified NCMI: Induction of labour for all females giving birth",179,678,2135,9099,26.401179940999999,23.464116936,1.6274955469000001,20.274225663999999,26.654008208,18.581630295,28.346603577]
["2016 and 2017","Level 2/3 (300+ births)","Kingaroy",678,681,"NCMI_0600","NCMI: Caesarean section for selected females giving birth for the first time",29,143,525,2406,20.279720279999999,21.820448878000001,3.4539051562999998,15.050794771,28.590102984000001,11.458733409000001,32.182164346999997]
["2016 and 2017","Level 2/3 (300+ births)","Kingaroy",678,681,"NCMI_0600_A","Modified NCMI: Caesarean section for all females giving birth",167,678,2201,9099,24.631268436999999,24.18947137,1.6446106729000001,20.966034451999999,27.412908289000001,19.255639351999999,29.123303389]
["2016 and 2017","Level 2/3 (300+ births)","Kingaroy",678,681,"NCMI_0700","NCMI: Non-instrumental vaginal birth for selected females giving birth for the first time",96,143,1513,2406,67.132867133000005,62.884455527999997,4.0400017358999998,54.966052124999997,70.802858929999999,50.764450320000002,75.004460735999999]
["2016 and 2017","Level 2/3 (300+ births)","Kingaroy",678,681,"NCMI_1500","NCMI: Females having their second birth vaginally whose first birth was by caesarean section",15,58,84,615,25.862068965999999,13.658536585,4.5091822733000004,4.8205393296999999,22.496533841000002,0.13098976549999999,27.186083405000002]
["2016 and 2017","Level 2/3 (300+ births)","Mareeba",393,394,"NCMI_0500","NCMI: Induction of labour for selected females giving birth for the first time",10,111,693,2406,9.0090090089999997,28.802992519,4.2982155042999999,20.378490129999999,37.227494907000001,15.908346006,41.697639031000001]
["2016 and 2017","Level 2/3 (300+ births)","Mareeba",393,394,"NCMI_0500_A","Modified NCMI: Induction of labour for all females giving birth",41,393,2135,9099,10.432569975,23.464116936,2.1376587690000002,19.274305749,27.653928123,17.051140628999999,29.877093243000001]
["2016 and 2017","Level 2/3 (300+ births)","Mareeba",393,394,"NCMI_0600","NCMI: Caesarean section for selected females giving birth for the first time",26,111,525,2406,23.423423422999999,21.820448878000001,3.9202786472,14.136702729,29.504195026000001,10.059612936000001,33.581284818999997]
["2016 and 2017","Level 2/3 (300+ births)","Mareeba",393,394,"NCMI_0600_A","Modified NCMI: Caesarean section for all females giving birth",72,393,2201,9099,18.320610686999999,24.18947137,2.1601388913999999,19.955599143000001,28.423343597999999,17.709054695999999,30.669888045]
["2016 and 2017","Level 2/3 (300+ births)","Mareeba",393,394,"NCMI_0700","NCMI: Non-instrumental vaginal birth for selected females giving birth for the first time",77,111,1513,2406,69.369369368999998,62.884455527999997,4.5855146054000002,53.896846901000004,71.872064154,49.127911712,76.640999343999994]
["2016 and 2017","Level 2/3 (300+ births)","Mareeba",393,394,"NCMI_1500","NCMI: Females having their second birth vaginally whose first birth was by caesarean section",6,19,84,615,31.578947368000001,13.658536585,7.8783448598000003,-1.7830193400000001,29.100092511,-9.9764979940000007,37.293571165000003]
["2016 and 2017","Level 2/3 (300+ births)","Mount Isa",893,900,"NCMI_0500","NCMI: Induction of labour for selected females giving birth for the first time",97,202,693,2406,48.019801979999997,28.802992519,3.1862070267,22.558026745999999,35.047958291,19.244371438999998,38.361613599000002]
["2016 and 2017","Level 2/3 (300+ births)","Mount Isa",893,900,"NCMI_0500_A","Modified NCMI: Induction of labour for all females giving birth",367,893,2135,9099,41.097424412000002,23.464116936,1.4181067571999999,20.684627691999999,26.24360618,19.209796663999999,27.718437208000001]
["2016 and 2017","Level 2/3 (300+ births)","Mount Isa",893,900,"NCMI_0600","NCMI: Caesarean section for selected females giving birth for the first time",30,202,525,2406,14.851485149,21.820448878000001,2.9060477213999998,16.124595343999999,27.516302412000002,13.102305714,30.538592042000001]
["2016 and 2017","Level 2/3 (300+ births)","Mount Isa",893,900,"NCMI_0600_A","Modified NCMI: Caesarean section for all females giving birth",223,893,2201,9099,24.972004478999999,24.18947137,1.4330199014,21.380752363999999,26.998190377,19.890411665999999,28.488531075000001]
["2016 and 2017","Level 2/3 (300+ births)","Mount Isa",893,900,"NCMI_0700","NCMI: Non-instrumental vaginal birth for selected females giving birth for the first time",129,202,1513,2406,63.861386138999997,62.884455527999997,3.3991778313999998,56.222066978000001,69.546844077000003,52.686922033999998,73.081989022000002]
["2016 and 2017","Level 2/3 (300+ births)","Mount Isa",893,900,"NCMI_1500","NCMI: Females having their second birth vaginally whose first birth was by caesarean section",17,62,84,615,27.419354839,13.658536585,4.3612998152999998,5.1103889473999997,22.206684223,0.57463713949999995,26.742436031]
["2016 and 2017","Level 2/3 (300+ births)","Proserpine",443,443,"NCMI_0500","NCMI: Induction of labour for selected females giving birth for the first time",44,139,693,2406,31.654676258999999,28.802992519,3.8409820329,21.274667734000001,36.331317302999999,17.280046420000001,40.325938616999998]
["2016 and 2017","Level 2/3 (300+ births)","Proserpine",443,443,"NCMI_0500_A","Modified NCMI: Induction of labour for all females giving birth",113,443,2135,9099,25.507900676999999,23.464116936,2.0134126494000002,19.517828142999999,27.410405729000001,17.423878987999998,29.504354884000001]
["2016 and 2017","Level 2/3 (300+ births)","Proserpine",443,443,"NCMI_0600","NCMI: Caesarean section for selected females giving birth for the first time",42,139,525,2406,30.215827338,21.820448878000001,3.5032491584000001,14.954080527,28.686817227999999,11.310701402999999,32.330196352999998]
["2016 and 2017","Level 2/3 (300+ births)","Proserpine",443,443,"NCMI_0600_A","Modified NCMI: Caesarean section for all females giving birth",123,443,2201,9099,27.765237020000001,24.18947137,2.0345861702999999,20.201682476999999,28.177260264000001,18.085712859000001,30.293229881999999]
["2016 and 2017","Level 2/3 (300+ births)","Proserpine",443,443,"NCMI_0700","NCMI: Non-instrumental vaginal birth for selected females giving birth for the first time",75,139,1513,2406,53.956834532000002,62.884455527999997,4.0977189704999999,54.852926345999997,70.915984710000004,50.591298616000003,75.177612439000001]
["2016 and 2017","Level 2/3 (300+ births)","Proserpine",443,443,"NCMI_1500","NCMI: Females having their second birth vaginally whose first birth was by caesarean section",4,40,84,615,10,13.658536585,5.4297744817,3.0161786012,24.300894569,-2.6307868600000002,29.947860030000001]
["2016 and 2017","Level 2/3 (300+ births)","Redland",753,760,"NCMI_0500","NCMI: Induction of labour for selected females giving birth for the first time",78,215,693,2406,36.279069767000003,28.802992519,3.0883779696000002,22.749771698,34.856213339,19.537858610000001,38.068126427000003]
["2016 and 2017","Level 2/3 (300+ births)","Redland",753,760,"NCMI_0500_A","Modified NCMI: Induction of labour for all females giving birth",224,753,2135,9099,29.747675962999999,23.464116936,1.5443195444,20.437250629000001,26.490983242999999,18.831158302999999,28.097075569000001]
["2016 and 2017","Level 2/3 (300+ births)","Redland",753,760,"NCMI_0600","NCMI: Caesarean section for selected females giving birth for the first time",45,215,525,2406,20.930232558,21.820448878000001,2.8168206541999998,16.299480396,27.341417360000001,13.369986915,30.270910839999999]
["2016 and 2017","Level 2/3 (300+ births)","Redland",753,760,"NCMI_0600_A","Modified NCMI: Caesarean section for all females giving birth",221,753,2201,9099,29.349269587999999,24.18947137,1.5605599720000001,21.130773824999999,27.248168916000001,19.507791455,28.871151286]
["2016 and 2017","Level 2/3 (300+ births)","Redland",753,760,"NCMI_0700","NCMI: Non-instrumental vaginal birth for selected females giving birth for the first time",129,215,1513,2406,60,62.884455527999997,3.2948097349999999,56.426628446999999,69.342282608000005,53.000026323,72.768884732999993]
["2016 and 2017","Level 2/3 (300+ births)","Redland",753,760,"NCMI_1500","NCMI: Females having their second birth vaginally whose first birth was by caesarean section",14,77,84,615,18.181818182000001,13.658536585,3.9135097956,5.9880573859000004,21.329015784999999,1.9180071985,25.399065971999999]
["2016 and 2017","Level 2/3 (300+ births)","Warwick",330,332,"NCMI_0500","NCMI: Induction of labour for selected females giving birth for the first time",18,63,693,2406,28.571428570999998,28.802992519,5.7053120247000004,17.620580950000001,39.985404086999999,11.687056445,45.918928592999997]
["2016 and 2017","Level 2/3 (300+ births)","Warwick",330,332,"NCMI_0500_A","Modified NCMI: Induction of labour for all females giving birth",73,330,2135,9099,22.121212120999999,23.464116936,2.3328009631,18.891827048,28.036406824,16.465714046999999,30.462519825000001]
["2016 and 2017","Level 2/3 (300+ births)","Warwick",330,332,"NCMI_0600","NCMI: Caesarean section for selected females giving birth for the first time",18,63,525,2406,28.571428570999998,21.820448878000001,5.2036508833999999,11.621293145999999,32.019604608999998,6.2094962274999999,37.431401528000002]
["2016 and 2017","Level 2/3 (300+ births)","Warwick",330,332,"NCMI_0600_A","Modified NCMI: Caesarean section for all females giving birth",72,330,2201,9099,21.818181817999999,24.18947137,2.3573332467000001,19.569098207,28.809844534,17.117471630000001,31.261471110999999]
["2016 and 2017","Level 2/3 (300+ births)","Warwick",330,332,"NCMI_0700","NCMI: Non-instrumental vaginal birth for selected females giving birth for the first time",41,63,1513,2406,65.079365078999999,62.884455527999997,6.0866635448000004,50.954594980000003,74.814316075999997,44.624464893999999,81.144446161999994]
["2016 and 2017","Level 2/3 (<300 births)","Ayr",194,194,"NCMI_0500","NCMI: Induction of labour for selected females giving birth for the first time",12,53,693,2406,22.641509434,28.802992519,6.2203058741000001,16.611193006000001,40.994792031999999,10.142074897000001,47.463910140999999]
["2016 and 2017","Level 2/3 (<300 births)","Ayr",194,194,"NCMI_0500_A","Modified NCMI: Induction of labour for all females giving birth",34,194,2135,9099,17.525773195999999,23.464116936,3.0425224461,17.500772942000001,29.427460929999999,14.336549598,32.591684274000002]
["2016 and 2017","Level 2/3 (<300 births)","Ayr",194,194,"NCMI_0600","NCMI: Caesarean section for selected females giving birth for the first time",12,53,525,2406,22.641509434,21.820448878000001,5.6733619505000004,10.700659455,32.940238301000001,4.8003630262000003,38.840534728999998]
["2016 and 2017","Level 2/3 (<300 births)","Ayr",194,194,"NCMI_0600_A","Modified NCMI: Caesarean section for all females giving birth",56,194,2201,9099,28.865979380999999,24.18947137,3.0745183277999999,18.163415447999999,30.215527293000001,14.965916387,33.413026354000003]
["2016 and 2017","Level 2/3 (<300 births)","Ayr",194,194,"NCMI_0700","NCMI: Non-instrumental vaginal birth for selected females giving birth for the first time",37,53,1513,2406,69.811320754999997,62.884455527999997,6.6360803471000001,49.877738047999998,75.891173007999996,42.976214487,82.792696569]
["2016 and 2017","Level 2/3 (<300 births)","Ayr",194,194,"NCMI_1500","NCMI: Females having their second birth vaginally whose first birth was by caesarean section",1,16,84,615,6.25,13.658536585,8.5852272716000009,-3.1685088669999999,30.485582038,-12.097145230000001,39.414218400000003]
["2016 and 2017","Level 2/3 (<300 births)","Biloela",113,113,"NCMI_0500","NCMI: Induction of labour for selected females giving birth for the first time",8,30,693,2406,26.666666667000001,28.802992519,8.2677826004000003,12.598138622,45.007846416,3.9996447173999998,53.606340320000001]
["2016 and 2017","Level 2/3 (<300 births)","Biloela",113,113,"NCMI_0500_A","Modified NCMI: Induction of labour for all females giving birth",21,113,2135,9099,18.584070795999999,23.464116936,3.9865336486,15.650510985,31.277722886999999,11.50451599,35.423717881999998]
["2016 and 2017","Level 2/3 (<300 births)","Biloela",113,113,"NCMI_0600","NCMI: Caesarean section for selected females giving birth for the first time",7,30,525,2406,23.333333332999999,21.820448878000001,7.5408065408000002,7.0404680579000001,36.600429697999999,-0.80197074400000001,44.442868500000003]
["2016 and 2017","Level 2/3 (<300 births)","Biloela",113,113,"NCMI_0600_A","Modified NCMI: Caesarean section for all females giving birth",22,113,2201,9099,19.469026548999999,24.18947137,4.028456974,16.293695701000001,32.085247039999999,12.104100448000001,36.274842292999999]
["2016 and 2017","Level 2/3 (<300 births)","Biloela",113,113,"NCMI_0700","NCMI: Non-instrumental vaginal birth for selected females giving birth for the first time",19,30,1513,2406,63.333333332999999,62.884455527999997,8.8204134554000007,45.596445154999998,80.172465900999995,36.423215161999998,89.345695894000002]
["2016 and 2017","Level 2/3 (<300 births)","Charleville",99,99,"NCMI_0500","NCMI: Induction of labour for selected females giving birth for the first time",10,28,693,2406,35.714285713999999,28.802992519,8.5579680370000002,12.029375165999999,45.576609871000002,3.1290884075999998,54.476896629999999]
["2016 and 2017","Level 2/3 (<300 births)","Charleville",99,99,"NCMI_0500_A","Modified NCMI: Induction of labour for all females giving birth",24,99,2135,9099,24.242424241999998,23.464116936,4.2590923654999999,15.116295900000001,31.811937971999999,10.686839838999999,36.241394032000002]
["2016 and 2017","Level 2/3 (<300 births)","Charleville",99,99,"NCMI_0600","NCMI: Caesarean section for selected females giving birth for the first time",4,28,525,2406,14.285714285999999,21.820448878000001,7.8054763251999999,6.5217152804999996,37.119182475000002,-1.5959800980000001,45.236877853000003]
["2016 and 2017","Level 2/3 (<300 births)","Charleville",99,99,"NCMI_0600_A","Modified NCMI: Caesarean section for all females giving birth",17,99,2201,9099,17.171717172000001,24.18947137,4.3038819826000001,15.753862685,32.625080056000002,11.277825422999999,37.101117318]
["2016 and 2017","Level 2/3 (<300 births)","Charleville",99,99,"NCMI_0700","NCMI: Non-instrumental vaginal birth for selected females giving birth for the first time",19,28,1513,2406,67.857142856999999,62.884455527999997,9.1299953171000006,44.989664705999999,80.779246349000005,35.494469576,90.274441479000004]
["2016 and 2017","Level 2/3 (<300 births)","Chinchilla",121,121,"NCMI_0500","NCMI: Induction of labour for selected females giving birth for the first time",6,30,693,2406,20,28.802992519,8.2677826004000003,12.598138622,45.007846416,3.9996447173999998,53.606340320000001]
["2016 and 2017","Level 2/3 (<300 births)","Chinchilla",121,121,"NCMI_0500_A","Modified NCMI: Induction of labour for all females giving birth",20,121,2135,9099,16.528925619999999,23.464116936,3.8524939973999999,15.913228701,31.015005170999999,11.906634944,35.021598928000003]
["2016 and 2017","Level 2/3 (<300 births)","Chinchilla",121,121,"NCMI_0600","NCMI: Caesarean section for selected females giving birth for the first time",7,30,525,2406,23.333333332999999,21.820448878000001,7.5408065408000002,7.0404680579000001,36.600429697999999,-0.80197074400000001,44.442868500000003]
["2016 and 2017","Level 2/3 (<300 births)","Chinchilla",121,121,"NCMI_0600_A","Modified NCMI: Caesarean section for all females giving birth",23,121,2201,9099,19.008264463,24.18947137,3.8930077303999999,16.559176219000001,31.819766521999998,12.510448179000001,35.868494562000002]
["2016 and 2017","Level 2/3 (<300 births)","Chinchilla",121,121,"NCMI_0700","NCMI: Non-instrumental vaginal birth for selected females giving birth for the first time",20,30,1513,2406,66.666666667000001,62.884455527999997,8.8204134554000007,45.596445154999998,80.172465900999995,36.423215161999998,89.345695894000002]
["2016 and 2017","Level 2/3 (<300 births)","Cooktown",23,23,"NCMI_0500_A","Modified NCMI: Induction of labour for all females giving birth",2,23,2135,9099,8.6956521738999992,23.464116936,8.8363058137999992,6.1449575409000001,40.783276331000003,-3.0448005060000001,49.973034376999998]
["2016 and 2017","Level 2/3 (<300 births)","Cooktown",23,23,"NCMI_0600_A","Modified NCMI: Caesarean section for all females giving birth",5,23,2201,9099,21.739130435,24.18947137,8.9292304840999996,6.6881796216999998,41.690763119000003,-2.5982200820000001,50.977162823]
["2016 and 2017","Level 2/3 (<300 births)","Goondiwindi",189,189,"NCMI_0500","NCMI: Induction of labour for selected females giving birth for the first time",11,50,693,2406,22,28.802992519,6.4041968643000002,16.250766665,41.355218373,9.5904019258000002,48.015583112000002]
["2016 and 2017","Level 2/3 (<300 births)","Goondiwindi",189,189,"NCMI_0500_A","Modified NCMI: Induction of labour for all females giving birth",45,189,2135,9099,23.809523810000002,23.464116936,3.082504745,17.422407635999999,29.505826236000001,14.216602700999999,32.711631171000001]
["2016 and 2017","Level 2/3 (<300 births)","Goondiwindi",189,189,"NCMI_0600","NCMI: Caesarean section for selected females giving birth for the first time",11,50,525,2406,22,21.820448878000001,5.8410836299,10.371924963,33.268972792,4.2971979881999998,39.343699766999997]
["2016 and 2017","Level 2/3 (<300 births)","Goondiwindi",189,189,"NCMI_0600_A","Modified NCMI: Caesarean section for all females giving birth",41,189,2201,9099,21.693121692999998,24.18947137,3.1149210899000002,18.084226034,30.294716706999999,14.844708101,33.534234640000001]
["2016 and 2017","Level 2/3 (<300 births)","Goondiwindi",189,189,"NCMI_0700","NCMI: Non-instrumental vaginal birth for selected females giving birth for the first time",27,50,1513,2406,54,62.884455527999997,6.8322628839000004,49.493220274999999,76.275690780000005,42.387666875999997,83.381244179999996]
["2016 and 2017","Level 2/3 (<300 births)","Goondiwindi",189,189,"NCMI_1500","NCMI: Females having their second birth vaginally whose first birth was by caesarean section",2,12,84,615,16.666666667000001,13.658536585,9.9133665525999994,-5.7716618579999999,33.088735028999999,-16.081563070000001,43.398636242999999]
["2016 and 2017","Level 2/3 (<300 births)","Ingham",52,52,"NCMI_0500","NCMI: Induction of labour for selected females giving birth for the first time",5,15,693,2406,33.333333332999999,28.802992519,11.692410283999999,5.8858683615,51.720116676000004,-6.2742383339999996,63.880223372000003]
["2016 and 2017","Level 2/3 (<300 births)","Ingham",52,52,"NCMI_0500_A","Modified NCMI: Induction of labour for all females giving birth",8,52,2135,9099,15.384615385,23.464116936,5.8766927348999998,11.945799176,34.982434695999999,5.8340387312999997,41.094195141]
["2016 and 2017","Level 2/3 (<300 births)","Ingham",52,52,"NCMI_0600","NCMI: Caesarean section for selected females giving birth for the first time",4,15,525,2406,26.666666667000001,21.820448878000001,10.664310881,0.91839955070000001,42.722498205000001,-10.172483769999999,53.813381520999997]
["2016 and 2017","Level 2/3 (<300 births)","Ingham",52,52,"NCMI_0600_A","Modified NCMI: Caesarean section for all females giving birth",14,52,2201,9099,26.923076923,24.18947137,5.9384934179000002,12.550024271,35.828918469999998,6.3739911168000001,42.004951624]
["2016 and 2017","Level 2/3 (<300 births)","Ingham",52,52,"NCMI_0700","NCMI: Non-instrumental vaginal birth for selected females giving birth for the first time",10,15,1513,2406,66.666666667000001,62.884455527999997,12.473948333999999,38.435516792000001,87.333394263000002,25.462610524999999,100.30630053]
["2016 and 2017","Level 2/3 (<300 births)","Longreach",132,132,"NCMI_0500","NCMI: Induction of labour for selected females giving birth for the first time",10,36,693,2406,27.777777778000001,28.802992519,7.5474183847000003,14.010052484999999,43.595932552999997,6.1607373647000001,51.445247672999997]
["2016 and 2017","Level 2/3 (<300 births)","Longreach",132,132,"NCMI_0500_A","Modified NCMI: Induction of labour for all females giving birth",30,132,2135,9099,22.727272726999999,23.464116936,3.6884821855999999,16.234691852000001,30.693542019999999,12.398670379,34.529563492999998]
["2016 and 2017","Level 2/3 (<300 births)","Longreach",132,132,"NCMI_0600","NCMI: Caesarean section for selected females giving birth for the first time",11,36,525,2406,30.555555556000002,21.820448878000001,6.8837830736000001,8.3282340535999992,35.312663702000002,1.1690996570000001,42.471798098999997]
["2016 and 2017","Level 2/3 (<300 births)","Longreach",132,132,"NCMI_0600_A","Modified NCMI: Caesarean section for all females giving birth",39,132,2201,9099,29.545454544999998,24.18947137,3.7272711317999998,16.884019951999999,31.494922789,13.007657975000001,35.371284766000002]
["2016 and 2017","Level 2/3 (<300 births)","Longreach",132,132,"NCMI_0700","NCMI: Non-instrumental vaginal birth for selected females giving birth for the first time",18,36,1513,2406,50,62.884455527999997,8.0518990267999992,47.102733434999998,78.666177619999999,38.728758446999997,87.040152608]
["2016 and 2017","Level 2/3 (<300 births)","Longreach",132,132,"NCMI_1500","NCMI: Females having their second birth vaginally whose first birth was by caesarean section",1,14,84,615,7.1428571428999996,13.658536585,9.1779940108000009,-4.3303316760000001,31.647404847000001,-13.875445450000001,41.192518618000001]
["2016 and 2017","Level 2/3 (<300 births)","Roma",259,260,"NCMI_0500","NCMI: Induction of labour for selected females giving birth for the first time",21,75,693,2406,28,28.802992519,5.2290048433000003,18.554143025999998,39.051842012000002,13.115977988999999,44.490007048999999]
["2016 and 2017","Level 2/3 (<300 births)","Roma",259,260,"NCMI_0500_A","Modified NCMI: Induction of labour for all females giving birth",49,259,2135,9099,18.918918918999999,23.464116936,2.6332056230999998,18.303033915,28.625199957,15.564500067000001,31.363733804999999]
["2016 and 2017","Level 2/3 (<300 births)","Roma",259,260,"NCMI_0600","NCMI: Caesarean section for selected females giving birth for the first time",17,75,525,2406,22.666666667000001,21.820448878000001,4.7692248127000001,12.472768244999999,31.168129511,7.5127744397000003,36.128123316]
["2016 and 2017","Level 2/3 (<300 births)","Roma",259,260,"NCMI_0600_A","Modified NCMI: Caesarean section for all females giving birth",76,259,2201,9099,29.343629344,24.18947137,2.6608970326999999,18.974113186,29.404829554999999,16.206780272,32.172162469]
["2016 and 2017","Level 2/3 (<300 births)","Roma",259,260,"NCMI_0700","NCMI: Non-instrumental vaginal birth for selected females giving birth for the first time",48,75,1513,2406,64,62.884455527999997,5.5785192846999996,51.95055773,73.818353325999993,46.148897673999997,79.620013381999996]
["2016 and 2017","Level 2/3 (<300 births)","St George",97,97,"NCMI_0500","NCMI: Induction of labour for selected females giving birth for the first time",6,20,693,2406,30,28.802992519,10.125924338000001,8.9561808168999999,48.649804220999997,-1.5747804940000001,59.180765532000002]
["2016 and 2017","Level 2/3 (<300 births)","St George",97,97,"NCMI_0500_A","Modified NCMI: Induction of labour for all females giving birth",20,97,2135,9099,20.618556700999999,23.464116936,4.3027765070999999,15.030674982000001,31.897558889999999,10.555787414999999,36.372446457000002]
["2016 and 2017","Level 2/3 (<300 births)","St George",97,97,"NCMI_0600","NCMI: Caesarean section for selected females giving birth for the first time",7,20,525,2406,35,21.820448878000001,9.2355641369000008,3.7187431694000002,39.922154585999998,-5.886243533,49.527141288999999]
["2016 and 2017","Level 2/3 (<300 births)","St George",97,97,"NCMI_0600_A","Modified NCMI: Caesarean section for all females giving birth",27,97,2201,9099,27.835051545999999,24.18947137,4.3480255168999999,15.667341357,32.711601383999998,11.14539482,37.233547921000003]
["2016 and 2017","Level 2/3 (<300 births)","St George",97,97,"NCMI_0700","NCMI: Non-instrumental vaginal birth for selected females giving birth for the first time",11,20,1513,2406,55,62.884455527999997,10.802756143,41.711053487000001,84.057857568000003,30.476187099000001,95.292723957000007]
["2016 and 2017","Level 2/3 (<300 births)","Stanthorpe",213,213,"NCMI_0500","NCMI: Induction of labour for selected females giving birth for the first time",14,52,693,2406,26.923076923,28.802992519,6.2798316884999998,16.494522409000002,41.111462627999998,9.9634974533000005,47.642487584000001]
["2016 and 2017","Level 2/3 (<300 births)","Stanthorpe",213,213,"NCMI_0500_A","Modified NCMI: Induction of labour for all females giving birth",37,213,2135,9099,17.370892018999999,23.464116936,2.9036539309,17.772955231000001,29.155278639999999,14.753155143000001,32.175078728999999]
["2016 and 2017","Level 2/3 (<300 births)","Stanthorpe",213,213,"NCMI_0600","NCMI: Caesarean section for selected females giving birth for the first time",14,52,525,2406,26.923076923,21.820448878000001,5.7276537325000003,10.594247562,33.046650194000001,4.6374876801999996,39.003410074999998]
["2016 and 2017","Level 2/3 (<300 births)","Stanthorpe",213,213,"NCMI_0600_A","Modified NCMI: Caesarean section for all females giving birth",47,213,2201,9099,22.0657277,24.18947137,2.9341894385999998,18.438460071000002,29.940482670000002,15.386903054999999,32.992039685999998]
["2016 and 2017","Level 2/3 (<300 births)","Stanthorpe",213,213,"NCMI_0700","NCMI: Non-instrumental vaginal birth for selected females giving birth for the first time",32,52,1513,2406,61.538461538,62.884455527999997,6.6995849551999997,49.753269015999997,76.015642040000003,42.785700662000004,82.983210392999993]
["2016 and 2017","Level 2/3 (<300 births)","Thursday Island",255,257,"NCMI_0500","NCMI: Induction of labour for selected females giving birth for the first time",11,53,693,2406,20.754716981000001,28.802992519,6.2203058741000001,16.611193006000001,40.994792031999999,10.142074897000001,47.463910140999999]
["2016 and 2017","Level 2/3 (<300 births)","Thursday Island",255,257,"NCMI_0500_A","Modified NCMI: Induction of labour for all females giving birth",46,255,2135,9099,18.039215685999999,23.464116936,2.6537778546999999,18.262712341,28.665521531,15.502783372,31.4254505]
["2016 and 2017","Level 2/3 (<300 births)","Thursday Island",255,257,"NCMI_0600","NCMI: Caesarean section for selected females giving birth for the first time",11,53,525,2406,20.754716981000001,21.820448878000001,5.6733619505000004,10.700659455,32.940238301000001,4.8003630262000003,38.840534728999998]
["2016 and 2017","Level 2/3 (<300 births)","Thursday Island",255,257,"NCMI_0600_A","Modified NCMI: Caesarean section for all females giving birth",60,255,2201,9099,23.529411764999999,24.18947137,2.6816856067999999,18.933367580999999,29.445575160000001,16.14441455,32.234528191000003]
["2016 and 2017","Level 2/3 (<300 births)","Thursday Island",255,257,"NCMI_0700","NCMI: Non-instrumental vaginal birth for selected females giving birth for the first time",37,53,1513,2406,69.811320754999997,62.884455527999997,6.6360803471000001,49.877738047999998,75.891173007999996,42.976214487,82.792696569]
["2016 and 2017","Level 2/3 (<300 births)","Thursday Island",255,257,"NCMI_1500","NCMI: Females having their second birth vaginally whose first birth was by caesarean section",1,8,84,615,12.5,13.658536585,12.141344844000001,-10.13849931,37.455572478999997,-22.76549795,50.082571115999997]
["2016 and 2017","Level 4/5","Bundaberg",1986,2005,"NCMI_0500","NCMI: Induction of labour for selected females giving birth for the first time",191,525,4187,11258,36.380952381,37.191330608999998,2.1093614418,33.056982183000002,41.325679035,30.863246283999999,43.519414935]
["2016 and 2017","Level 4/5","Bundaberg",1986,2005,"NCMI_0500_A","Modified NCMI: Induction of labour for all females giving birth",621,1986,13202,44282,31.268882175000002,29.813468226000001,1.0264635204999999,27.801599725999999,31.825336727,26.734077665000001,32.892858787999998]
["2016 and 2017","Level 4/5","Bundaberg",1986,2005,"NCMI_0600","NCMI: Caesarean section for selected females giving birth for the first time",145,525,2766,11258,27.619047619,24.569195238999999,1.8788416742,20.886665558000001,28.251724920000001,18.932670216000002,30.205720261]
["2016 and 2017","Level 4/5","Bundaberg",1986,2005,"NCMI_0600_A","Modified NCMI: Caesarean section for all females giving birth",609,1986,12721,44282,30.664652568000001,28.727248092,1.0153579048000001,26.737146597999999,30.717349585000001,25.681174377000001,31.773321805999998]
["2016 and 2017","Level 4/5","Bundaberg",1986,2005,"NCMI_0700","NCMI: Non-instrumental vaginal birth for selected females giving birth for the first time",274,525,6146,11258,52.190476189999998,54.592289927000003,2.17295536,50.333297422000001,58.851282433000002,48.073423847000001,61.111156006999998]
["2016 and 2017","Level 4/5","Bundaberg",1986,2005,"NCMI_1500","NCMI: Females having their second birth vaginally whose first birth was by caesarean section",24,172,673,3571,13.953488372000001,18.846261551000001,2.9819657366999999,13.001608707000001,24.690914395,9.9003643411999995,27.792158762]
["2016 and 2017","Level 4/5","Caboolture",3783,3821,"NCMI_0500","NCMI: Induction of labour for selected females giving birth for the first time",354,943,4187,11258,37.539766702000001,37.191330608999998,1.5738915669,34.106503138000001,40.276158080000002,32.469655908999997,41.913005310000003]
["2016 and 2017","Level 4/5","Caboolture",3783,3821,"NCMI_0500_A","Modified NCMI: Induction of labour for all females giving birth",1161,3783,13202,44282,30.689928628000001,29.813468226000001,0.74372943650000001,28.355758530999999,31.271177922,27.582279917000001,32.044656535999998]
["2016 and 2017","Level 4/5","Caboolture",3783,3821,"NCMI_0600","NCMI: Caesarean section for selected females giving birth for the first time",174,943,2766,11258,18.451749735,24.569195238999999,1.4018901682,21.821490509,27.316899969000001,20.363524733999999,28.774865744]
["2016 and 2017","Level 4/5","Caboolture",3783,3821,"NCMI_0600_A","Modified NCMI: Caesarean section for all females giving birth",968,3783,12721,44282,25.588157547000002,28.727248092,0.73568280539999997,27.285309793,30.16918639,26.520199676000001,30.934296507999999]
["2016 and 2017","Level 4/5","Caboolture",3783,3821,"NCMI_0700","NCMI: Non-instrumental vaginal birth for selected females giving birth for the first time",602,943,6146,11258,63.838812300999997,54.592289927000003,1.6213419135,51.414459776999998,57.770120077999998,49.728264187000001,59.456315668000002]
["2016 and 2017","Level 4/5","Caboolture",3783,3821,"NCMI_1500","NCMI: Females having their second birth vaginally whose first birth was by caesarean section",72,316,673,3571,22.784810127,18.846261551000001,2.2000032945000001,14.534255094000001,23.158268009,12.246251667999999,25.446271435]
["2016 and 2017","Level 4/5","Cairns",4543,4618,"NCMI_0500","NCMI: Induction of labour for selected females giving birth for the first time",387,1114,4187,11258,34.739676840000001,37.191330608999998,1.4480650088,34.353123191999998,40.029538027000001,32.847135582999996,41.535525636000003]
["2016 and 2017","Level 4/5","Cairns",4543,4618,"NCMI_0500_A","Modified NCMI: Induction of labour for all females giving birth",1282,4543,13202,44282,28.219238389000001,29.813468226000001,0.6786748776,28.483265465999999,31.143670986,27.777443594000001,31.849492859000001]
["2016 and 2017","Level 4/5","Cairns",4543,4618,"NCMI_0600","NCMI: Caesarean section for selected females giving birth for the first time",325,1114,2766,11258,29.174147217000002,24.569195238999999,1.2898144583,22.041158900999999,27.097231576999999,20.699751864,28.438638613999998]
["2016 and 2017","Level 4/5","Cairns",4543,4618,"NCMI_0600_A","Modified NCMI: Caesarean section for all females giving birth",1534,4543,12721,44282,33.766233765999999,28.727248092,0.67133209120000004,27.411437193000001,30.043058989999999,26.713251818,30.741244365]
["2016 and 2017","Level 4/5","Cairns",4543,4618,"NCMI_0700","NCMI: Non-instrumental vaginal birth for selected females giving birth for the first time",556,1114,6146,11258,49.910233392999999,54.592289927000003,1.4917218833000001,51.668515036000002,57.516064817999997,50.117124277000002,59.067455576999997]
["2016 and 2017","Level 4/5","Cairns",4543,4618,"NCMI_1500","NCMI: Females having their second birth vaginally whose first birth was by caesarean section",57,386,673,3571,14.766839378,18.846261551000001,1.9905505921,14.944782391,22.747740711999999,12.874609775,24.817913327999999]
["2016 and 2017","Level 4/5","Hervey Bay",1655,1679,"NCMI_0500","NCMI: Induction of labour for selected females giving birth for the first time",124,365,4187,11258,33.972602739999999,37.191330608999998,2.5297885495000001,32.232945051999998,42.149716165999997,29.601964961,44.780696257999999]
["2016 and 2017","Level 4/5","Hervey Bay",1655,1679,"NCMI_0500_A","Modified NCMI: Induction of labour for all females giving birth",452,1655,13202,44282,27.311178248000001,29.813468226000001,1.1244344493,27.609576705999999,32.017359747,26.440164878000001,33.186771573999998]
["2016 and 2017","Level 4/5","Hervey Bay",1655,1679,"NCMI_0600","NCMI: Caesarean section for selected females giving birth for the first time",71,365,2766,11258,19.452054794999999,24.569195238999999,2.2533227637,20.152682622,28.985707856000001,17.809226947999999,31.329163529999999]
["2016 and 2017","Level 4/5","Hervey Bay",1655,1679,"NCMI_0600_A","Modified NCMI: Caesarean section for all females giving birth",446,1655,12721,44282,26.948640482999998,28.727248092,1.1122688568000001,26.547201132000001,30.907295050999998,25.390441521,32.064054661999997]
["2016 and 2017","Level 4/5","Hervey Bay",1655,1679,"NCMI_0700","NCMI: Non-instrumental vaginal birth for selected females giving birth for the first time",203,365,6146,11258,55.616438356000003,54.592289927000003,2.6060576813999998,49.484416871999997,59.700162982999998,46.774116882999998,62.410462971000001]
["2016 and 2017","Level 4/5","Hervey Bay",1655,1679,"NCMI_1500","NCMI: Females having their second birth vaginally whose first birth was by caesarean section",23,143,673,3571,16.083916083999998,18.846261551000001,3.2703847859000001,12.436307371,25.256215732000001,9.0351071936,28.657415909000001]
["2016 and 2017","Level 4/5","Ipswich",5030,5087,"NCMI_0500","NCMI: Induction of labour for selected females giving birth for the first time",431,1146,4187,11258,37.609075044000001,37.191330608999998,1.4277045577,34.393029675999998,39.989631541999998,32.908216936000002,41.474444282]
["2016 and 2017","Level 4/5","Ipswich",5030,5087,"NCMI_0500_A","Modified NCMI: Induction of labour for all females giving birth",1426,5030,13202,44282,28.349900596000001,29.813468226000001,0.64498430870000001,28.549298981,31.077637470999999,27.8785153,31.748421151999999]
["2016 and 2017","Level 4/5","Ipswich",5030,5087,"NCMI_0600","NCMI: Caesarean section for selected females giving birth for the first time",247,1146,2766,11258,21.553228620999999,24.569195238999999,1.2716790817000001,22.076704239000001,27.061686239,20.754157994,28.384232484000002]
["2016 and 2017","Level 4/5","Ipswich",5030,5087,"NCMI_0600_A","Modified NCMI: Caesarean section for all females giving birth",1274,5030,12721,44282,25.328031808999999,28.727248092,0.63800603060000005,27.476756271999999,29.977739912000001,26.813230000000001,30.641266183999999]
["2016 and 2017","Level 4/5","Ipswich",5030,5087,"NCMI_0700","NCMI: Non-instrumental vaginal birth for selected females giving birth for the first time",681,1146,6146,11258,59.424083770000003,54.592289927000003,1.4707475967000001,51.709624638000001,57.474955217000002,50.180047137000003,59.004532716999996]
["2016 and 2017","Level 4/5","Ipswich",5030,5087,"NCMI_1500","NCMI: Females having their second birth vaginally whose first birth was by caesarean section",79,367,673,3571,21.525885558999999,18.846261551000001,2.0414269336999999,14.845064761,22.847458340999999,12.72198075,24.970542351999999]
["2016 and 2017","Level 4/5","Logan",6595,6675,"NCMI_0500","NCMI: Induction of labour for selected females giving birth for the first time",690,1565,4187,11258,44.089456869000003,37.191330608999998,1.2217250645,34.796749482999999,39.585911736,33.526155416000002,40.856505802999997]
["2016 and 2017","Level 4/5","Logan",6595,6675,"NCMI_0500_A","Modified NCMI: Induction of labour for all females giving birth",2182,6595,13202,44282,33.085670962999998,29.813468226000001,0.56328182930000004,28.709435841000001,30.917500612000001,28.123622738000002,31.503313714000001]
["2016 and 2017","Level 4/5","Logan",6595,6675,"NCMI_0600","NCMI: Caesarean section for selected females giving birth for the first time",412,1565,2766,11258,26.325878593999999,24.569195238999999,1.0882098818999999,22.43630387,26.702086606999998,21.304565593,27.833824884999999]
["2016 and 2017","Level 4/5","Logan",6595,6675,"NCMI_0600_A","Modified NCMI: Caesarean section for all females giving birth",1839,6595,12721,44282,27.884761182999998,28.727248092,0.55718751479999995,27.635160562999999,29.819335621,27.055685547,30.398810636]
["2016 and 2017","Level 4/5","Logan",6595,6675,"NCMI_0700","NCMI: Non-instrumental vaginal birth for selected females giving birth for the first time",801,1565,6146,11258,51.182108626000002,54.592289927000003,1.2585581469,52.125515958999998,57.059063895000001,50.816615487,58.367964368000003]
["2016 and 2017","Level 4/5","Logan",6595,6675,"NCMI_1500","NCMI: Females having their second birth vaginally whose first birth was by caesarean section",123,495,673,3571,24.848484847999998,18.846261551000001,1.7577790054,15.401014700999999,22.291508402000002,13.572924535,24.119598567000001]
["2016 and 2017","Level 4/5","Mackay",2761,2797,"NCMI_0500","NCMI: Induction of labour for selected females giving birth for the first time",299,740,4187,11258,40.405405405000003,37.191330608999998,1.7767028332000001,33.708993055999997,40.673668161999998,31.86122211,42.521439108999999]
["2016 and 2017","Level 4/5","Mackay",2761,2797,"NCMI_0500_A","Modified NCMI: Induction of labour for all females giving birth",931,2761,13202,44282,33.719666787000001,29.813468226000001,0.87056246520000002,28.107165795,31.519770657999999,27.201780831000001,32.425155621999998]
["2016 and 2017","Level 4/5","Mackay",2761,2797,"NCMI_0600","NCMI: Caesarean section for selected females giving birth for the first time",165,740,2766,11258,22.297297297,24.569195238999999,1.5825373781000001,21.467421978000001,27.670968500000001,19.821583104999998,29.316807373]
["2016 and 2017","Level 4/5","Mackay",2761,2797,"NCMI_0600_A","Modified NCMI: Caesarean section for all females giving birth",712,2761,12721,44282,25.787758059000002,28.727248092,0.86114358960000004,27.039406656000001,30.415089526999999,26.143817323,31.310678861]
["2016 and 2017","Level 4/5","Mackay",2761,2797,"NCMI_0700","NCMI: Non-instrumental vaginal birth for selected females giving birth for the first time",392,740,6146,11258,52.972972972999997,54.592289927000003,1.8302676193,51.004965392999999,58.179614461,49.101487069000001,60.083092784999998]
["2016 and 2017","Level 4/5","Mackay",2761,2797,"NCMI_1500","NCMI: Females having their second birth vaginally whose first birth was by caesarean section",45,186,673,3571,24.193548387,18.846261551000001,2.8675460460000002,13.225871301,24.466651802000001,10.243623413,27.448899690000001]
["2016 and 2017","Level 4/5","Nambour",3240,3277,"NCMI_0500","NCMI: Induction of labour for selected females giving birth for the first time",311,1007,4187,11258,30.883813307,37.191330608999998,1.523056167,34.206140521999998,40.176520697000001,32.622162107999998,41.760499109999998]
["2016 and 2017","Level 4/5","Nambour",3240,3277,"NCMI_0500_A","Modified NCMI: Induction of labour for all females giving birth",836,3240,13202,44282,25.802469135999999,29.813468226000001,0.80363831900000005,28.238337121000001,31.388599331999998,27.402553268999998,32.224383183]
["2016 and 2017","Level 4/5","Nambour",3240,3277,"NCMI_0600","NCMI: Caesarean section for selected females giving birth for the first time",197,1007,2766,11258,19.563058590000001,24.569195238999999,1.3566102716999999,21.910239105999999,27.228151370999999,20.499364423999999,28.639026053999999]
["2016 and 2017","Level 4/5","Nambour",3240,3277,"NCMI_0600_A","Modified NCMI: Caesarean section for all females giving birth",856,3240,12721,44282,26.419753086,28.727248092,0.7949435158,27.169158800999998,30.285337383000002,26.342417544,31.112078639]
["2016 and 2017","Level 4/5","Nambour",3240,3277,"NCMI_0700","NCMI: Non-instrumental vaginal birth for selected females giving birth for the first time",529,1007,6146,11258,52.532274080999997,54.592289927000003,1.5689739064999999,51.517101070000002,57.667478783999996,49.885368208000003,59.299211647]
["2016 and 2017","Level 4/5","Nambour",3240,3277,"NCMI_1500","NCMI: Females having their second birth vaginally whose first birth was by caesarean section",57,251,673,3571,22.709163347,18.846261551000001,2.4684822673000002,14.008036307999999,23.684486795000002,11.440814749999999,26.251708353000001]
["2016 and 2017","Level 4/5","Redcliffe",3298,3330,"NCMI_0500","NCMI: Induction of labour for selected females giving birth for the first time",303,836,4187,11258,36.244019139000002,37.191330608999998,1.6715813461,33.915031171000003,40.467630047999997,32.176586571000001,42.206074647999998]
["2016 and 2017","Level 4/5","Redcliffe",3298,3330,"NCMI_0500_A","Modified NCMI: Induction of labour for all females giving birth",945,3298,13202,44282,28.653729533,29.813468226000001,0.79654041499999995,28.252249013,31.374687439999999,27.423846981000001,32.203089470999998]
["2016 and 2017","Level 4/5","Redcliffe",3298,3330,"NCMI_0600","NCMI: Caesarean section for selected females giving birth for the first time",229,836,2766,11258,27.392344498,24.569195238999999,1.4889040032,21.650943392999999,27.487447084999999,20.102483229000001,29.035907248000001]
["2016 and 2017","Level 4/5","Redcliffe",3298,3330,"NCMI_0600_A","Modified NCMI: Caesarean section for all females giving birth",1032,3298,12721,44282,31.291691934999999,28.727248092,0.78792240609999997,27.182920176,30.271576008,26.363480873,31.09101531]
["2016 and 2017","Level 4/5","Redcliffe",3298,3330,"NCMI_0700","NCMI: Non-instrumental vaginal birth for selected females giving birth for the first time",437,836,6146,11258,52.272727273000001,54.592289927000003,1.7219768853999999,51.217215232000001,57.967364623000002,49.426359271000003,59.758220583000004]
["2016 and 2017","Level 4/5","Redcliffe",3298,3330,"NCMI_1500","NCMI: Females having their second birth vaginally whose first birth was by caesarean section",33,305,673,3571,10.819672131000001,18.846261551000001,2.2393240935000001,14.457186328000001,23.235336775,12.128289271,25.564233831999999]
["2016 and 2017","Level 4/5","Redland",2768,2805,"NCMI_0500","NCMI: Induction of labour for selected females giving birth for the first time",300,839,4187,11258,35.756853397,37.191330608999998,1.6685901454000001,33.920893923999998,40.461767293999998,32.185560172999999,42.197101044999997]
["2016 and 2017","Level 4/5","Redland",2768,2805,"NCMI_0500_A","Modified NCMI: Induction of labour for all females giving birth",838,2768,13202,44282,30.274566474,29.813468226000001,0.86946098490000001,28.109324696000002,31.517611757000001,27.205085272000002,32.421851181000001]
["2016 and 2017","Level 4/5","Redland",2768,2805,"NCMI_0600","NCMI: Caesarean section for selected females giving birth for the first time",273,839,2766,11258,32.538736591000003,24.569195238999999,1.4862396931999999,21.656165439999999,27.482225037999999,20.110476159000001,29.027914319000001]
["2016 and 2017","Level 4/5","Redland",2768,2805,"NCMI_0600_A","Modified NCMI: Caesarean section for all females giving birth",916,2768,12721,44282,33.092485549000003,28.727248092,0.86005402649999996,27.041542199999999,30.412953984000001,26.147086011999999,31.307410171000001]
["2016 and 2017","Level 4/5","Redland",2768,2805,"NCMI_0700","NCMI: Non-instrumental vaginal birth for selected females giving birth for the first time",458,839,6146,11258,54.588796186000003,54.592289927000003,1.7188955047000001,51.223254738000001,57.961325115999998,49.435603413000003,59.748976441000003]
["2016 and 2017","Level 4/5","Redland",2768,2805,"NCMI_1500","NCMI: Females having their second birth vaginally whose first birth was by caesarean section",46,286,673,3571,16.083916083999998,18.846261551000001,2.3125112591999999,14.313739483000001,23.378783619,11.908727774000001,25.783795329]
["2016 and 2017","Level 4/5","Rockhampton",2465,2492,"NCMI_0500","NCMI: Induction of labour for selected females giving birth for the first time",211,572,4187,11258,36.888111887999997,37.191330608999998,2.0208433071999998,33.230477727,41.152183491000002,31.128800687999998,43.253860531000001]
["2016 and 2017","Level 4/5","Rockhampton",2465,2492,"NCMI_0500_A","Modified NCMI: Induction of labour for all females giving birth",711,2465,13202,44282,28.843813387000001,29.813468226000001,0.92135008419999997,28.007622060999999,31.619314391,27.049417974000001,32.577518478999998]
["2016 and 2017","Level 4/5","Rockhampton",2465,2492,"NCMI_0600","NCMI: Caesarean section for selected females giving birth for the first time",144,572,2766,11258,25.174825174999999,24.569195238999999,1.7999971684,21.041200789000001,28.097189689,19.169203734,29.969186744000002]
["2016 and 2017","Level 4/5","Rockhampton",2465,2492,"NCMI_0600_A","Modified NCMI: Caesarean section for all females giving birth",721,2465,12721,44282,29.249492901,28.727248092,0.91138172220000002,26.940939916000001,30.513556266999998,25.993102924999999,31.461393258000001]
["2016 and 2017","Level 4/5","Rockhampton",2465,2492,"NCMI_0700","NCMI: Non-instrumental vaginal birth for selected females giving birth for the first time",297,572,6146,11258,51.923076923000004,54.592289927000003,2.0817685432999999,50.512023581999998,58.672556272000001,48.346984296999999,60.837595557]
["2016 and 2017","Level 4/5","Rockhampton",2465,2492,"NCMI_1500","NCMI: Females having their second birth vaginally whose first birth was by caesarean section",31,193,673,3571,16.062176166,18.846261551000001,2.8150636439999999,13.328736809,24.363786294000001,10.401070619,27.291452483]
["2016 and 2017","Level 4/5","Sunshine Coast University Hospital",2198,2225,"NCMI_0500","NCMI: Induction of labour for selected females giving birth for the first time",197,644,4187,11258,30.590062111999998,37.191330608999998,1.9045295748,33.458452643000001,40.924208575999998,31.477741885,42.904919333999999]
["2016 and 2017","Level 4/5","Sunshine Coast University Hospital",2198,2225,"NCMI_0500_A","Modified NCMI: Induction of labour for all females giving birth",636,2198,13202,44282,28.935395814,29.813468226000001,0.97570672339999998,27.901083049,31.725853403999999,26.886348055999999,32.740588397000003]
["2016 and 2017","Level 4/5","Sunshine Coast University Hospital",2198,2225,"NCMI_0600","NCMI: Caesarean section for selected females giving birth for the first time",137,644,2766,11258,21.273291924999999,24.569195238999999,1.6963946832000001,21.244261659999999,27.894128817999999,19.480011188999999,29.658379287999999]
["2016 and 2017","Level 4/5","Sunshine Coast University Hospital",2198,2225,"NCMI_0600_A","Modified NCMI: Caesarean section for all females giving birth",582,2198,12721,44282,26.478616924000001,28.727248092,0.96515026059999998,26.835553580999999,30.618942603000001,25.831797309999999,31.622698874000001]
["2016 and 2017","Level 4/5","Sunshine Coast University Hospital",2198,2225,"NCMI_0700","NCMI: Non-instrumental vaginal birth for selected females giving birth for the first time",356,644,6146,11258,55.279503106,54.592289927000003,1.9619481354999999,50.746871581999997,58.437708272999998,48.706445520999999,60.478134334000003]
["2016 and 2017","Level 4/5","Sunshine Coast University Hospital",2198,2225,"NCMI_1500","NCMI: Females having their second birth vaginally whose first birth was by caesarean section",32,176,673,3571,18.181818182000001,18.846261551000001,2.9478850090000002,13.068406934,24.624116169000001,10.002606524000001,27.689916578999998]
["2016 and 2017","Level 4/5","Toowoomba",3960,4019,"NCMI_0500","NCMI: Induction of labour for selected females giving birth for the first time",389,962,4187,11258,40.436590437,37.191330608999998,1.5582714677,34.137118532999999,40.245542686,32.516516205999999,41.866145013000001]
["2016 and 2017","Level 4/5","Toowoomba",3960,4019,"NCMI_0500_A","Modified NCMI: Induction of labour for all females giving birth",1181,3960,13202,44282,29.823232322999999,29.813468226000001,0.72691821040000004,28.388708533999999,31.238227919,27.632713594999998,31.994222858000001]
["2016 and 2017","Level 4/5","Toowoomba",3960,4019,"NCMI_0600","NCMI: Caesarean section for selected females giving birth for the first time",247,962,2766,11258,25.675675676000001,24.569195238999999,1.3879770982999999,21.848760125999998,27.289630352,20.405263944000001,28.733126534]
["2016 and 2017","Level 4/5","Toowoomba",3960,4019,"NCMI_0600_A","Modified NCMI: Caesarean section for all females giving birth",1232,3960,12721,44282,31.111111111,28.727248092,0.71905346489999999,27.317903301000001,30.136592882999999,26.570087697000002,30.884408487000002]
["2016 and 2017","Level 4/5","Toowoomba",3960,4019,"NCMI_0700","NCMI: Non-instrumental vaginal birth for selected females giving birth for the first time",560,962,6146,11258,58.212058212000002,54.592289927000003,1.605250893,51.445998177,57.738581676999999,49.776537247999997,59.408042606000002]
["2016 and 2017","Level 4/5","Toowoomba",3960,4019,"NCMI_1500","NCMI: Females having their second birth vaginally whose first birth was by caesarean section",51,295,673,3571,17.288135593,18.846261551000001,2.2769624285000001,14.383415191999999,23.309107911000002,12.015374266,25.677148837000001]
["2016 and 2017","Level 6","Gold Coast University Hospital",9987,10128,"NCMI_0500","NCMI: Induction of labour for selected females giving birth for the first time",1331,3235,4414,11210,41.143740340000001,39.375557538000002,0.85901370830000001,37.691890669999999,41.059224405999998,36.798516413000002,41.952598663000003]
["2016 and 2017","Level 6","Gold Coast University Hospital",9987,10128,"NCMI_0500_A","Modified NCMI: Induction of labour for all females giving birth",3374,9987,11327,36235,33.783919095000002,31.259831653999999,0.4638537673,30.350678271,32.168985038000002,29.868270353,32.651392956000002]
["2016 and 2017","Level 6","Gold Coast University Hospital",9987,10128,"NCMI_0600","NCMI: Caesarean section for selected females giving birth for the first time",645,3235,2639,11210,19.938176198000001,23.541480821,0.7459207484,22.079476154000002,25.003485487999999,21.303718576000001,25.779243065999999]
["2016 and 2017","Level 6","Gold Coast University Hospital",9987,10128,"NCMI_0600_A","Modified NCMI: Caesarean section for all females giving birth",2634,9987,11014,36235,26.374286572999999,30.396025942000001,0.46026494229999998,29.493906655,31.298145228999999,29.015231114999999,31.776820769]
["2016 and 2017","Level 6","Gold Coast University Hospital",9987,10128,"NCMI_0700","NCMI: Non-instrumental vaginal birth for selected females giving birth for the first time",1818,3235,5764,11210,56.197836166999998,51.418376449999997,0.87873525249999995,49.696055354999999,53.140697543999998,48.782170692000001,54.054582207000003]
["2016 and 2017","Level 6","Gold Coast University Hospital",9987,10128,"NCMI_1500","NCMI: Females having their second birth vaginally whose first birth was by caesarean section",134,771,537,3172,17.380025939999999,16.929382093000001,1.3505699576000001,14.282264976,19.576499210000001,12.877672219999999,20.981091966000001]
["2016 and 2017","Level 6","Mater Mothers' Hospital",12027,12226,"NCMI_0500","NCMI: Induction of labour for selected females giving birth for the first time",1634,3810,4414,11210,42.887139108,39.375557538000002,0.79154343110000003,37.824132413000001,40.926982662999997,37.000927245,41.750187830999998]
["2016 and 2017","Level 6","Mater Mothers' Hospital",12027,12226,"NCMI_0500_A","Modified NCMI: Induction of labour for all females giving birth",4063,12027,11327,36235,33.782323106,31.259831653999999,0.4226880381,30.431363099999999,32.088300209000003,29.991767540000001,32.527895768999997]
["2016 and 2017","Level 6","Mater Mothers' Hospital",12027,12226,"NCMI_0600","NCMI: Caesarean section for selected females giving birth for the first time",848,3810,2639,11210,22.257217848,23.541480821,0.68733323199999996,22.194307685999998,24.888653955999999,21.479481125,25.603480517000001]
["2016 and 2017","Level 6","Mater Mothers' Hospital",12027,12226,"NCMI_0600_A","Modified NCMI: Caesarean section for all females giving birth",3546,12027,11014,36235,29.483661761,30.396025942000001,0.4194177113,29.573967228000001,31.218084655999998,29.137772808000001,31.654279076000002]
["2016 and 2017","Level 6","Mater Mothers' Hospital",12027,12226,"NCMI_0700","NCMI: Non-instrumental vaginal birth for selected females giving birth for the first time",1933,3810,5764,11210,50.734908136000001,51.418376449999997,0.80971596850000005,49.831333151000003,53.005419748000001,48.989228543999999,53.847524354999997]
["2016 and 2017","Level 6","Mater Mothers' Hospital",12027,12226,"NCMI_1500","NCMI: Females having their second birth vaginally whose first birth was by caesarean section",217,1085,537,3172,20,16.929382093000001,1.1384904838000001,14.697940745,19.160823442000002,13.513910642000001,20.344853544999999]
["2016 and 2017","Level 6","Royal Brisbane and Women's",9190,9415,"NCMI_0500","NCMI: Induction of labour for selected females giving birth for the first time",986,2898,4414,11210,34.023464457999999,39.375557538000002,0.90758653980000004,37.596687920000001,41.154427155999997,36.652797917999997,42.098317156999997]
["2016 and 2017","Level 6","Royal Brisbane and Women's",9190,9415,"NCMI_0500_A","Modified NCMI: Induction of labour for all females giving birth",2389,9190,11327,36235,25.995647442999999,31.259831653999999,0.48354940969999999,30.312074811999999,32.207588497000003,29.809183425000001,32.710479884000002]
["2016 and 2017","Level 6","Royal Brisbane and Women's",9190,9415,"NCMI_0600","NCMI: Caesarean section for selected females giving birth for the first time",820,2898,2639,11210,28.295376121,23.541480821,0.78809875149999997,21.996807268000001,25.086154373999999,21.177184566000001,25.905777075]
["2016 and 2017","Level 6","Royal Brisbane and Women's",9190,9415,"NCMI_0600_A","Modified NCMI: Caesarean section for all females giving birth",3302,9190,11014,36235,35.930359086000003,30.396025942000001,0.47980819990000001,29.455601869999999,31.336450014,28.956601341999999,31.835450542]
["2016 and 2017","Level 6","Royal Brisbane and Women's",9190,9415,"NCMI_0700","NCMI: Non-instrumental vaginal birth for selected females giving birth for the first time",1339,2898,5764,11210,46.204278813000002,51.418376449999997,0.92842323650000003,49.598666905999998,53.238085992999999,48.633106740000002,54.203646159000002]
["2016 and 2017","Level 6","Royal Brisbane and Women's",9190,9415,"NCMI_1500","NCMI: Females having their second birth vaginally whose first birth was by caesarean section",113,908,537,3172,12.444933921000001,16.929382093000001,1.2445184794999999,14.490125873,19.368638313000002,13.195826654999999,20.662937532000001]
["2016 and 2017","Level 6","Townsville",5031,5134,"NCMI_0500","NCMI: Induction of labour for selected females giving birth for the first time",463,1267,4414,11210,36.543014995999997,39.375557538000002,1.372615597,36.685230967999999,42.065884107999999,35.257710746999997,43.493404329000001]
["2016 and 2017","Level 6","Townsville",5031,5134,"NCMI_0500_A","Modified NCMI: Induction of labour for all females giving birth",1501,5031,11327,36235,29.835022857999999,31.259831653999999,0.65353891760000005,29.978895376000001,32.540767932999998,29.299214901999999,33.220448406999999]
["2016 and 2017","Level 6","Townsville",5031,5134,"NCMI_0600","NCMI: Caesarean section for selected females giving birth for the first time",326,1267,2639,11210,25.730071034000002,23.541480821,1.1919046734000001,21.205347661000001,25.877613981,19.965766801000001,27.117194841]
["2016 and 2017","Level 6","Townsville",5031,5134,"NCMI_0600_A","Modified NCMI: Caesarean section for all females giving birth",1532,5031,11014,36235,30.451202544000001,30.396025942000001,0.6484825032,29.125000235000002,31.667051648000001,28.450578432,32.341473450999999]
["2016 and 2017","Level 6","Townsville",5031,5134,"NCMI_0700","NCMI: Non-instrumental vaginal birth for selected females giving birth for the first time",674,1267,5764,11210,53.196527230000001,51.418376449999997,1.4041285972999999,48.666284398999998,54.170468499999998,47.205990657999997,55.630762242000003]
["2016 and 2017","Level 6","Townsville",5031,5134,"NCMI_1500","NCMI: Females having their second birth vaginally whose first birth was by caesarean section",73,408,537,3172,17.892156863,16.929382093000001,1.8565822432000001,13.290480897,20.56828329,11.359635364000001,22.499128822999999]
["2016 and 2017","Queensland","Level 1",231,231,"NCMI_0500","NCMI: Induction of labour for selected females giving birth for the first time",9,40,12496,33652,22.5,37.133008439000001,7.6394380162999997,22.159709927000002,52.106306951000001,14.214694391,60.051322487999997]
["2016 and 2017","Queensland","Level 1",231,231,"NCMI_0500_A","Modified NCMI: Induction of labour for all females giving birth",23,231,35473,119937,9.9567099566999993,29.576360922999999,3.0027944897999999,23.690883722999999,35.461838123,20.567977453000001,38.584744391999998]
["2016 and 2017","Queensland","Level 1",231,231,"NCMI_0600","NCMI: Caesarean section for selected females giving birth for the first time",5,40,9586,33652,12.5,28.485676929,7.1364099916999999,14.498313345,42.473040511999997,7.0764469534999996,49.894906904000003]
["2016 and 2017","Queensland","Level 1",231,231,"NCMI_0600_A","Modified NCMI: Caesarean section for all females giving birth",24,231,41241,119937,10.38961039,34.385552414999999,3.1252283217999999,28.260104903999999,40.510999925999997,25.009867450000002,43.761237379999997]
["2016 and 2017","Queensland","Level 1",231,231,"NCMI_0700","NCMI: Non-instrumental vaginal birth for selected females giving birth for the first time",29,40,16356,33652,72.5,48.603351955000001,7.9026093383999996,33.114237652,64.092466259000005,24.89552394,72.311179971000001]
["2016 and 2017","Queensland","Level 1",231,231,"NCMI_1500","NCMI: Females having their second birth vaginally whose first birth was by caesarean section",1,10,1592,12476,10,12.760500159999999,10.550922480000001,-7.9193078999999997,33.440308219999999,-18.892267279999999,44.413267599000001]
["2016 and 2017","Queensland","Level 2/3",9099,9133,"NCMI_0500","NCMI: Induction of labour for selected females giving birth for the first time",693,2406,12496,33652,28.802992519,37.133008439000001,0.98501670470000002,35.202375697999997,39.063641181000001,34.177958324999999,40.088058554]
["2016 and 2017","Queensland","Level 2/3",9099,9133,"NCMI_0500_A","Modified NCMI: Induction of labour for all females giving birth",2135,9099,35473,119937,23.464116936,29.576360922999999,0.47844802669999997,28.638602791,30.514119054999998,28.141016842999999,31.011705002999999]
["2016 and 2017","Queensland","Level 2/3",9099,9133,"NCMI_0600","NCMI: Caesarean section for selected females giving birth for the first time",525,2406,9586,33652,21.820448878000001,28.485676929,0.9201570899,26.682169032000001,30.289184825,25.725205659,31.246148198]
["2016 and 2017","Queensland","Level 2/3",9099,9133,"NCMI_0600_A","Modified NCMI: Caesarean section for all females giving birth",2201,9099,41241,119937,24.18947137,34.385552414999999,0.49795593020000001,33.409558791999999,35.361546038,32.891684624,35.879420205999999]
["2016 and 2017","Queensland","Level 2/3",9099,9133,"NCMI_0700","NCMI: Non-instrumental vaginal birth for selected females giving birth for the first time",1513,2406,16356,33652,62.884455527999997,48.603351955000001,1.0189495867,46.606210765,50.600493145000002,45.546503195,51.660200715000002]
["2016 and 2017","Queensland","Level 2/3",9099,9133,"NCMI_1500","NCMI: Females having their second birth vaginally whose first birth was by caesarean section",84,615,1592,12476,13.658536585,12.760500159999999,1.3454044948999999,10.123507350000001,15.39749297,8.7242866757000002,16.796713645000001]
["2016 and 2017","Queensland","Level 4/5",44282,44830,"NCMI_0500","NCMI: Induction of labour for selected females giving birth for the first time",4187,11258,12496,33652,37.191330608999998,37.133008439000001,0.45536619319999999,36.240490700999999,38.025526178,35.766909859999998,38.499107019]
["2016 and 2017","Queensland","Level 4/5",44282,44830,"NCMI_0500_A","Modified NCMI: Induction of labour for all females giving birth",13202,44282,35473,119937,29.813468226000001,29.576360922999999,0.21687924189999999,29.151277609000001,30.001444237000001,28.925723197,30.226998647999999]
["2016 and 2017","Queensland","Level 4/5",44282,44830,"NCMI_0600","NCMI: Caesarean section for selected females giving birth for the first time",2766,11258,9586,33652,24.569195238999999,28.485676929,0.42538205610000002,27.651928098999999,29.319425759000001,27.20953076,29.761823097000001]
["2016 and 2017","Queensland","Level 4/5",44282,44830,"NCMI_0600_A","Modified NCMI: Caesarean section for all females giving birth",12721,44282,41241,119937,28.727248092,34.385552414999999,0.22572212359999999,33.943137053000001,34.827967776999998,33.708386044000001,35.062718785999998]
["2016 and 2017","Queensland","Level 4/5",44282,44830,"NCMI_0700","NCMI: Non-instrumental vaginal birth for selected females giving birth for the first time",6146,11258,16356,33652,54.592289927000003,48.603351955000001,0.47105312240000002,47.680087835000002,49.526616075,47.190192588000002,50.016511321999999]
["2016 and 2017","Queensland","Level 4/5",44282,44830,"NCMI_1500","NCMI: Females having their second birth vaginally whose first birth was by caesarean section",673,3571,1592,12476,18.846261551000001,12.760500159999999,0.55833584079999998,11.666161912,13.854838408000001,11.085492638,14.435507683000001]
["2016 and 2017","Queensland","Level 6",36235,36903,"NCMI_0500","NCMI: Induction of labour for selected females giving birth for the first time",4414,11210,12496,33652,39.375557538000002,37.133008439000001,0.45634006599999999,36.238581910000001,38.027434968999998,35.763988241,38.502028637000002]
["2016 and 2017","Queensland","Level 6",36235,36903,"NCMI_0500_A","Modified NCMI: Induction of labour for all females giving birth",11327,36235,35473,119937,31.259831653999999,29.576360922999999,0.23975488649999999,29.106441345,30.046280500000002,28.857096262999999,30.295625582]
["2016 and 2017","Queensland","Level 6",36235,36903,"NCMI_0600","NCMI: Caesarean section for selected females giving birth for the first time",2639,11210,9586,33652,23.541480821,28.485676929,0.42629180309999998,27.650144994000001,29.321208862999999,27.206801518999999,29.764552338000001]
["2016 and 2017","Queensland","Level 6",36235,36903,"NCMI_0600_A","Modified NCMI: Caesarean section for all females giving birth",11014,36235,41241,119937,30.396025942000001,34.385552414999999,0.2495304837,33.896472666999998,34.874632163000001,33.636960963999996,35.134143866000002]
["2016 and 2017","Queensland","Level 6",36235,36903,"NCMI_0700","NCMI: Non-instrumental vaginal birth for selected females giving birth for the first time",5764,11210,16356,33652,51.418376449999997,48.603351955000001,0.47206054419999999,47.678113289000002,49.528590622000003,47.187170322999997,50.019533588000002]
["2016 and 2017","Queensland","Level 6",36235,36903,"NCMI_1500","NCMI: Females having their second birth vaginally whose first birth was by caesarean section",537,3172,1592,12476,16.929382093000001,12.760500159999999,0.59241199420000001,11.599372652,13.921627668999999,10.983264178000001,14.537736143]
["2016 and 2017","Queensland","Private",30090,30660,"NCMI_0500","NCMI: Induction of labour for selected females giving birth for the first time",3193,8738,12496,33652,36.541542687000003,37.133008439000001,0.51687483349999996,36.119933766000003,38.146083113000003,35.582383939000003,38.683632940000003]
["2016 and 2017","Queensland","Private",30090,30660,"NCMI_0500_A","Modified NCMI: Induction of labour for all females giving birth",8786,30090,35473,119937,29.199069458,29.576360922999999,0.26309979300000003,29.060685328999998,30.092036517,28.787061544,30.365660301999998]
["2016 and 2017","Queensland","Private",30090,30660,"NCMI_0600","NCMI: Caesarean section for selected females giving birth for the first time",3651,8738,9586,33652,41.783016709000002,28.485676929,0.48284058569999999,27.539309380999999,29.432044477000002,27.037155170999998,29.934198685999998]
["2016 and 2017","Queensland","Private",30090,30660,"NCMI_0600_A","Modified NCMI: Caesarean section for all females giving birth",15281,30090,41241,119937,50.784313724999997,34.385552414999999,0.273827239,33.848851027000002,34.922253802999997,33.564070698000002,35.207034131999997]
["2016 and 2017","Queensland","Private",30090,30660,"NCMI_0700","NCMI: Non-instrumental vaginal birth for selected females giving birth for the first time",2904,8738,16356,33652,33.234149690999999,48.603351955000001,0.53468067640000005,47.555377829000001,49.651326081000001,46.999309926000002,50.207393985000003]
["2016 and 2017","Queensland","Private",30090,30660,"NCMI_1500","NCMI: Females having their second birth vaginally whose first birth was by caesarean section",297,5108,1592,12476,5.8144087706000001,12.760500159999999,0.46683669719999998,11.845500233999999,13.675500087,11.359990069,14.161010252000001]
["2018 and 2019","Level 2/3 (300+ births)","Beaudesert",578,578,"NCMI_0500","NCMI: Induction of labour for selected females giving birth for the first time",56,200,767,2235,28,34.317673378000002,3.3571301969,27.737698192,40.897648564000001,24.246282787999998,44.389063968999999]
["2018 and 2019","Level 2/3 (300+ births)","Beaudesert",578,578,"NCMI_0500_A","Modified NCMI: Induction of labour for all females giving birth",133,578,2339,8346,23.010380623,28.025401389999999,1.8681064816999999,24.363912685999999,31.686890093999999,22.421081945000001,33.629720835000001]
["2018 and 2019","Level 2/3 (300+ births)","Beaudesert",578,578,"NCMI_0600","NCMI: Caesarean section for selected females giving birth for the first time",49,200,558,2235,24.5,24.966442953000001,3.0604909913,18.967880610000002,30.965005296000001,15.784969979,34.147915927]
["2018 and 2019","Level 2/3 (300+ births)","Beaudesert",578,578,"NCMI_0600_A","Modified NCMI: Caesarean section for all females giving birth",118,578,2104,8346,20.415224912999999,25.209681283999998,1.8061027352000001,21.669719923999999,28.749642645000002,19.791373079,30.627989490000001]
["2018 and 2019","Level 2/3 (300+ births)","Beaudesert",578,578,"NCMI_0700","NCMI: Non-instrumental vaginal birth for selected females giving birth for the first time",119,200,1321,2235,59.5,59.105145413999999,3.4764179315999999,52.291366267999997,65.918924559999994,48.675891618999998,69.534399209]
["2018 and 2019","Level 2/3 (300+ births)","Dalby",471,471,"NCMI_0500","NCMI: Induction of labour for selected females giving birth for the first time",32,121,767,2235,26.446280991999998,34.317673378000002,4.3160900499999997,25.85813688,42.777209876000001,21.369403227999999,47.265943528000001]
["2018 and 2019","Level 2/3 (300+ births)","Dalby",471,471,"NCMI_0500_A","Modified NCMI: Induction of labour for all females giving birth",116,471,2339,8346,24.628450105999999,28.025401389999999,2.0694507389000001,23.969277942000002,32.081524838,21.817049173000001,34.233753606999997]
["2018 and 2019","Level 2/3 (300+ births)","Dalby",471,471,"NCMI_0600","NCMI: Caesarean section for selected females giving birth for the first time",44,121,558,2235,36.363636364000001,24.966442953000001,3.9347162431,17.254399116999998,32.678486790000001,13.162294224,36.770591682000003]
["2018 and 2019","Level 2/3 (300+ births)","Dalby",471,471,"NCMI_0600_A","Modified NCMI: Caesarean section for all females giving birth",139,471,2104,8346,29.511677282000001,25.209681283999998,2.0007642371999999,21.28818338,29.131179189000001,19.207388572999999,31.211973996000001]
["2018 and 2019","Level 2/3 (300+ births)","Dalby",471,471,"NCMI_0700","NCMI: Non-instrumental vaginal birth for selected females giving birth for the first time",61,121,1321,2235,50.413223139999999,59.105145413999999,4.4694521703000003,50.34501916,67.865271668000005,45.696788902999998,72.513501925]
["2018 and 2019","Level 2/3 (300+ births)","Dalby",471,471,"NCMI_1500","NCMI: Females having their second birth vaginally whose first birth was by caesarean section",3,35,72,568,8.5714285714000003,12.676056338,5.6237334562000001,1.6535387639000001,23.698573912000001,-4.1951440309999999,29.547256706999999]
["2018 and 2019","Level 2/3 (300+ births)","Emerald",648,648,"NCMI_0500","NCMI: Induction of labour for selected females giving birth for the first time",83,165,767,2235,50.303030303,34.317673378000002,3.6960787014999998,27.073359122999999,41.561987633000001,23.229437272999998,45.405909483000002]
["2018 and 2019","Level 2/3 (300+ births)","Emerald",648,648,"NCMI_0500_A","Modified NCMI: Induction of labour for all females giving birth",252,648,2339,8346,38.888888889,28.025401389999999,1.7643227882000001,24.567328724999999,31.483474054999999,22.732433024999999,33.318369754999999]
["2018 and 2019","Level 2/3 (300+ births)","Emerald",648,648,"NCMI_0600","NCMI: Caesarean section for selected females giving birth for the first time",29,165,558,2235,17.575757576000001,24.966442953000001,3.3694896849,18.362243170999999,31.570642735,14.857973897999999,35.074912007999998]
["2018 and 2019","Level 2/3 (300+ births)","Emerald",648,648,"NCMI_0600_A","Modified NCMI: Caesarean section for all females giving birth",119,648,2104,8346,18.364197530999999,25.209681283999998,1.7057636943000001,21.866384444000001,28.552978124999999,20.092390202000001,30.326972367]
["2018 and 2019","Level 2/3 (300+ births)","Emerald",648,648,"NCMI_0700","NCMI: Non-instrumental vaginal birth for selected females giving birth for the first time",94,165,1321,2235,56.969696970000001,59.105145413999999,3.8274101750999998,51.603421470999997,66.606869356999994,47.622914889,70.587375938999998]
["2018 and 2019","Level 2/3 (300+ births)","Emerald",648,648,"NCMI_1500","NCMI: Females having their second birth vaginally whose first birth was by caesarean section",8,39,72,568,20.512820513000001,12.676056338,5.3275366644000002,2.2340844758,23.118028200000001,-3.3065536550000001,28.658666330999999]
["2018 and 2019","Level 2/3 (300+ births)","Gladstone",1119,1124,"NCMI_0500","NCMI: Induction of labour for selected females giving birth for the first time",96,306,767,2235,31.372549020000001,34.317673378000002,2.7140789020999998,28.99807873,39.637268026000001,26.175436672,42.459910084000001]
["2018 and 2019","Level 2/3 (300+ births)","Gladstone",1119,1124,"NCMI_0500_A","Modified NCMI: Induction of labour for all females giving birth",298,1119,2339,8346,26.630920464999999,28.025401389999999,1.3426119343,25.393881999000001,30.656920781,23.997565587,32.053237193000001]
["2018 and 2019","Level 2/3 (300+ births)","Gladstone",1119,1124,"NCMI_0600","NCMI: Caesarean section for selected females giving birth for the first time",82,306,558,2235,26.797385621,24.966442953000001,2.4742603182999998,20.116892729,29.815993176999999,17.543661998000001,32.389223907999998]
["2018 and 2019","Level 2/3 (300+ births)","Gladstone",1119,1124,"NCMI_0600_A","Modified NCMI: Caesarean section for all females giving birth",275,1119,2104,8346,24.575513852,25.209681283999998,1.2980497152999999,22.665503842,27.753858726000001,21.315532137999998,29.103830429999999]
["2018 and 2019","Level 2/3 (300+ births)","Gladstone",1119,1124,"NCMI_0700","NCMI: Non-instrumental vaginal birth for selected females giving birth for the first time",171,306,1321,2235,55.882352941000001,59.105145413999999,2.8105173197000002,53.596531466999998,64.613759361000007,50.673593455000002,67.536697372999996]
["2018 and 2019","Level 2/3 (300+ births)","Gladstone",1119,1124,"NCMI_1500","NCMI: Females having their second birth vaginally whose first birth was by caesarean section",15,74,72,568,20.270270270000001,12.676056338,3.8676119273,5.0955369603999996,20.256575716,1.0732205560000001,24.278892119999998]
["2018 and 2019","Level 2/3 (300+ births)","Gympie",585,586,"NCMI_0500","NCMI: Induction of labour for selected females giving birth for the first time",61,149,767,2235,40.939597315,34.317673378000002,3.8894666148999999,26.694318812999999,41.941027943000002,22.649273532999999,45.986073222999998]
["2018 and 2019","Level 2/3 (300+ births)","Gympie",585,586,"NCMI_0500_A","Modified NCMI: Induction of labour for all females giving birth",179,585,2339,8346,30.598290597999998,28.025401389999999,1.8568961400999999,24.385884955000002,31.664917824,22.454712969999999,33.596089810000002]
["2018 and 2019","Level 2/3 (300+ births)","Gympie",585,586,"NCMI_0600","NCMI: Caesarean section for selected females giving birth for the first time",36,149,558,2235,24.161073825999999,24.966442953000001,3.545789659,18.016695220999999,31.916190685,14.329073976,35.603811929999999]
["2018 and 2019","Level 2/3 (300+ births)","Gympie",585,586,"NCMI_0600_A","Modified NCMI: Caesarean section for all females giving birth",159,585,2104,8346,27.179487178999999,25.209681283999998,1.7952644726,21.690962918,28.728399651,19.823887867,30.595474702000001]
["2018 and 2019","Level 2/3 (300+ births)","Gympie",585,586,"NCMI_0700","NCMI: Non-instrumental vaginal birth for selected females giving birth for the first time",94,149,1321,2235,63.087248322000001,59.105145413999999,4.0276696736000002,51.210912854,66.999377973999998,47.022136392999997,71.188154435000001]
["2018 and 2019","Level 2/3 (300+ births)","Gympie",585,586,"NCMI_1500","NCMI: Females having their second birth vaginally whose first birth was by caesarean section",1,41,72,568,2.4390243902000002,12.676056338,5.1959722428999999,2.4919507419000002,22.860161934000001,-2.9118603909999998,28.263973066999998]
["2018 and 2019","Level 2/3 (300+ births)","Innisfail",392,393,"NCMI_0500","NCMI: Induction of labour for selected females giving birth for the first time",30,104,767,2235,28.846153846,34.317673378000002,4.6555019474000003,25.192889561000001,43.442457195000003,20.351167535999998,48.284179219999999]
["2018 and 2019","Level 2/3 (300+ births)","Innisfail",392,393,"NCMI_0500_A","Modified NCMI: Induction of labour for all females giving birth",77,392,2339,8346,19.642857143000001,28.025401389999999,2.2684150134999999,23.579307964000002,32.471494816000003,21.22015635,34.830646430000002]
["2018 and 2019","Level 2/3 (300+ births)","Innisfail",392,393,"NCMI_0600","NCMI: Caesarean section for selected females giving birth for the first time",24,104,558,2235,23.076923077,24.966442953000001,4.2441373836,16.647933681000001,33.284952224999998,12.234030801999999,37.698855104000003]
["2018 and 2019","Level 2/3 (300+ births)","Innisfail",392,393,"NCMI_0600_A","Modified NCMI: Caesarean section for all females giving birth",108,392,2104,8346,27.551020407999999,25.209681283999998,2.1931247497999999,20.911156774999998,29.508205793999998,18.630307035000001,31.789055533999999]
["2018 and 2019","Level 2/3 (300+ births)","Innisfail",392,393,"NCMI_0700","NCMI: Non-instrumental vaginal birth for selected females giving birth for the first time",60,104,1321,2235,57.692307692,59.105145413999999,4.8209242720000001,49.656133840999999,68.554156986999999,44.642372598000001,73.567918230000004]
["2018 and 2019","Level 2/3 (300+ births)","Innisfail",392,393,"NCMI_1500","NCMI: Females having their second birth vaginally whose first birth was by caesarean section",2,35,72,568,5.7142857142999999,12.676056338,5.6237334562000001,1.6535387639000001,23.698573912000001,-4.1951440309999999,29.547256706999999]
["2018 and 2019","Level 2/3 (300+ births)","Kingaroy",569,571,"NCMI_0500","NCMI: Induction of labour for selected females giving birth for the first time",56,125,767,2235,44.8,34.317673378000002,4.2464711294999997,25.994589963999999,42.640756791999998,21.578259989999999,47.057086767000001]
["2018 and 2019","Level 2/3 (300+ births)","Kingaroy",569,571,"NCMI_0500_A","Modified NCMI: Induction of labour for all females giving birth",196,569,2339,8346,34.446397187999999,28.025401389999999,1.8828226464,24.335069003000001,31.715733777000001,22.376933450999999,33.673869328999999]
["2018 and 2019","Level 2/3 (300+ births)","Kingaroy",569,571,"NCMI_0600","NCMI: Caesarean section for selected females giving birth for the first time",35,125,558,2235,28,24.966442953000001,3.8712489163999999,17.378795076999999,32.554090829000003,13.352696204000001,36.580189701999998]
["2018 and 2019","Level 2/3 (300+ births)","Kingaroy",569,571,"NCMI_0600_A","Modified NCMI: Caesarean section for all females giving birth",168,569,2104,8346,29.525483304000002,25.209681283999998,1.8203304601999999,21.641833583,28.777528986,19.748689903999999,30.670672665000001]
["2018 and 2019","Level 2/3 (300+ births)","Kingaroy",569,571,"NCMI_0700","NCMI: Non-instrumental vaginal birth for selected females giving birth for the first time",80,125,1321,2235,64,59.105145413999999,4.3973595049999998,50.486320784,67.723970043999998,45.913066899,72.297223928999998]
["2018 and 2019","Level 2/3 (300+ births)","Kingaroy",569,571,"NCMI_1500","NCMI: Females having their second birth vaginally whose first birth was by caesarean section",5,34,72,568,14.705882353,12.676056338,5.7058360976999998,1.4926175865,23.859495089999999,-4.4414519549999998,29.793564630999999]
["2018 and 2019","Level 2/3 (300+ births)","Mareeba",351,351,"NCMI_0500","NCMI: Induction of labour for selected females giving birth for the first time",16,100,767,2235,16,34.317673378000002,4.747699055,25.012183230000002,43.623163525999999,20.074576213,48.560770542999997]
["2018 and 2019","Level 2/3 (300+ births)","Mareeba",351,351,"NCMI_0500_A","Modified NCMI: Induction of labour for all females giving birth",29,351,2339,8346,8.2621082620999999,28.025401389999999,2.3972426087000001,23.326805877000002,32.723996903,20.833673564000001,35.217129215999996]
["2018 and 2019","Level 2/3 (300+ births)","Mareeba",351,351,"NCMI_0600","NCMI: Caesarean section for selected females giving birth for the first time",20,100,558,2235,20,24.966442953000001,4.3281878673999996,16.483194733000001,33.449691172999998,11.981879351,37.951006554999999]
["2018 and 2019","Level 2/3 (300+ births)","Mareeba",351,351,"NCMI_0600_A","Modified NCMI: Caesarean section for all females giving birth",64,351,2104,8346,18.233618234000001,25.209681283999998,2.3176764681000002,20.667035407,29.752327162,18.25665188,32.162710689000001]
["2018 and 2019","Level 2/3 (300+ births)","Mareeba",351,351,"NCMI_0700","NCMI: Non-instrumental vaginal birth for selected females giving birth for the first time",75,100,1321,2235,75,59.105145413999999,4.9163973873,49.469006534999998,68.741284293000007,44.355953251999999,73.854337576000006]
["2018 and 2019","Level 2/3 (300+ births)","Mareeba",351,351,"NCMI_1500","NCMI: Females having their second birth vaginally whose first birth was by caesarean section",2,16,72,568,12.5,12.676056338,8.3176139514000003,-3.626467007,28.978579683,-12.276785520000001,37.628898192000001]
["2018 and 2019","Level 2/3 (300+ births)","Mount Isa",887,895,"NCMI_0500","NCMI: Induction of labour for selected females giving birth for the first time",125,207,767,2235,60.386473430000002,34.317673378000002,3.2998789553000001,27.849910626,40.785436130000001,24.418036512,44.217310243999997]
["2018 and 2019","Level 2/3 (300+ births)","Mount Isa",887,895,"NCMI_0500_A","Modified NCMI: Induction of labour for all females giving birth",424,887,2339,8346,47.801578354,28.025401389999999,1.5080083164,25.069705089999999,30.981097689999999,23.501376441000001,32.549426339]
["2018 and 2019","Level 2/3 (300+ births)","Mount Isa",887,895,"NCMI_0600","NCMI: Caesarean section for selected females giving birth for the first time",40,207,558,2235,19.323671498,24.966442953000001,3.0082985237000002,19.070177847,30.862708058999999,15.941547382,33.991338524]
["2018 and 2019","Level 2/3 (300+ births)","Mount Isa",887,895,"NCMI_0600_A","Modified NCMI: Caesarean section for all females giving birth",223,887,2104,8346,25.140924464000001,25.209681283999998,1.4579564771,22.352086588999999,28.067275980000002,20.835811852999999,29.583550716000001]
["2018 and 2019","Level 2/3 (300+ births)","Mount Isa",887,895,"NCMI_0700","NCMI: Non-instrumental vaginal birth for selected females giving birth for the first time",137,207,1321,2235,66.183574879000005,59.105145413999999,3.4171324016,52.407565906999999,65.802724921000006,48.853748209000003,69.356542618999995]
["2018 and 2019","Level 2/3 (300+ births)","Mount Isa",887,895,"NCMI_1500","NCMI: Females having their second birth vaginally whose first birth was by caesarean section",15,62,72,568,24.193548387,12.676056338,4.2253521127000004,4.3943661972000001,20.957746479000001,0,25.352112676000001]
["2018 and 2019","Level 2/3 (300+ births)","Proserpine",439,439,"NCMI_0500","NCMI: Induction of labour for selected females giving birth for the first time",42,132,767,2235,31.818181817999999,34.317673378000002,4.1323416134000004,26.218283816,42.417062940000001,21.920648537999998,46.714698218000002]
["2018 and 2019","Level 2/3 (300+ births)","Proserpine",439,439,"NCMI_0500_A","Modified NCMI: Induction of labour for all females giving birth",117,439,2339,8346,26.651480637999999,28.025401389999999,2.1435483621000002,23.824046599999999,32.226756180000002,21.594756304000001,34.456046475999997]
["2018 and 2019","Level 2/3 (300+ births)","Proserpine",439,439,"NCMI_0600","NCMI: Caesarean section for selected females giving birth for the first time",28,132,558,2235,21.212121212,24.966442953000001,3.7672039924999998,17.582723128000001,32.350162777999998,13.664830975999999,36.268054929999998]
["2018 and 2019","Level 2/3 (300+ births)","Proserpine",439,439,"NCMI_0600_A","Modified NCMI: Caesarean section for all females giving birth",116,439,2104,8346,26.423690205,25.209681283999998,2.0724025089999998,21.147772367000002,29.271590201999999,18.992473756999999,31.426888812000001]
["2018 and 2019","Level 2/3 (300+ births)","Proserpine",439,439,"NCMI_0700","NCMI: Non-instrumental vaginal birth for selected females giving birth for the first time",75,132,1321,2235,56.818181817999999,59.105145413999999,4.2791746646000002,50.717963071,67.492327756999998,46.267621419999998,71.942669408]
["2018 and 2019","Level 2/3 (300+ births)","Proserpine",439,439,"NCMI_1500","NCMI: Females having their second birth vaginally whose first birth was by caesarean section",7,40,72,568,17.5,12.676056338,5.2605209568999998,2.3654352625000001,22.986677413999999,-3.1055065329999998,28.457619209000001]
["2018 and 2019","Level 2/3 (300+ births)","Warwick",355,355,"NCMI_0500","NCMI: Induction of labour for selected females giving birth for the first time",28,92,767,2235,30.434782608999999,34.317673378000002,4.9498184328999999,24.61602925,44.019317506999997,19.468218079,49.167128677000001]
["2018 and 2019","Level 2/3 (300+ births)","Warwick",355,355,"NCMI_0500_A","Modified NCMI: Induction of labour for all females giving birth",93,355,2339,8346,26.197183099,28.025401389999999,2.3836987567999999,23.353351827000001,32.697450953000001,20.874305118999999,35.176497660000003]
["2018 and 2019","Level 2/3 (300+ births)","Warwick",355,355,"NCMI_0600","NCMI: Caesarean section for selected females giving birth for the first time",30,92,558,2235,32.608695652000002,24.966442953000001,4.5124477855,16.122045292999999,33.810840613000003,11.429099596,38.503786310000002]
["2018 and 2019","Level 2/3 (300+ births)","Warwick",355,355,"NCMI_0600_A","Modified NCMI: Caesarean section for all females giving birth",96,355,2104,8346,27.042253520999999,25.209681283999998,2.304582146,20.692700278,29.726662291,18.295934847000002,32.123427722000002]
["2018 and 2019","Level 2/3 (300+ births)","Warwick",355,355,"NCMI_0700","NCMI: Non-instrumental vaginal birth for selected females giving birth for the first time",47,92,1321,2235,51.086956522000001,59.105145413999999,5.1256986024,49.058776152999997,69.151514675000001,43.728049607000003,74.482241220999995]
["2018 and 2019","Level 2/3 (300+ births)","Warwick",355,355,"NCMI_1500","NCMI: Females having their second birth vaginally whose first birth was by caesarean section",2,24,72,568,8.3333333333000006,12.676056338,6.7913033528,-0.63489823300000003,25.987010909999999,-7.6978537200000003,33.049966396000002]
["2018 and 2019","Level 2/3 (<300 births)","Atherton",295,295,"NCMI_0500","NCMI: Induction of labour for selected females giving birth for the first time",29,92,767,2235,31.52173913,34.317673378000002,4.9498184328999999,24.61602925,44.019317506999997,19.468218079,49.167128677000001]
["2018 and 2019","Level 2/3 (<300 births)","Atherton",295,295,"NCMI_0500_A","Modified NCMI: Induction of labour for all females giving birth",70,295,2339,8346,23.728813558999999,28.025401389999999,2.6148967091999999,22.90020384,33.150598940000002,20.180711261999999,35.870091516999999]
["2018 and 2019","Level 2/3 (<300 births)","Atherton",295,295,"NCMI_0600","NCMI: Caesarean section for selected females giving birth for the first time",26,92,558,2235,28.260869565,24.966442953000001,4.5124477855,16.122045292999999,33.810840613000003,11.429099596,38.503786310000002]
["2018 and 2019","Level 2/3 (<300 births)","Atherton",295,295,"NCMI_0600_A","Modified NCMI: Caesarean section for all females giving birth",81,295,2104,8346,27.457627119000001,25.209681283999998,2.5281064783999998,20.254592587000001,30.164769981999999,17.625361849000001,32.79400072]
["2018 and 2019","Level 2/3 (<300 births)","Atherton",295,295,"NCMI_0700","NCMI: Non-instrumental vaginal birth for selected females giving birth for the first time",55,92,1321,2235,59.782608695999997,59.105145413999999,5.1256986024,49.058776152999997,69.151514675000001,43.728049607000003,74.482241220999995]
["2018 and 2019","Level 2/3 (<300 births)","Ayr",166,166,"NCMI_0500","NCMI: Induction of labour for selected females giving birth for the first time",14,43,767,2235,32.558139535000002,34.317673378000002,7.2401731826000004,20.126933940000001,48.508412816000003,12.59715383,56.038192926000001]
["2018 and 2019","Level 2/3 (<300 births)","Ayr",166,166,"NCMI_0500_A","Modified NCMI: Induction of labour for all females giving birth",35,166,2339,8346,21.084337348999998,28.025401389999999,3.4858725341999999,21.193091223,34.857711557000002,17.567783787,38.483018993000002]
["2018 and 2019","Level 2/3 (<300 births)","Ayr",166,166,"NCMI_0600","NCMI: Caesarean section for selected females giving birth for the first time",14,43,558,2235,32.558139535000002,24.966442953000001,6.6004246191,12.029610699999999,37.903275207,5.1651690955999996,44.767716810000003]
["2018 and 2019","Level 2/3 (<300 births)","Ayr",166,166,"NCMI_0600_A","Modified NCMI: Caesarean section for all females giving birth",55,166,2104,8346,33.132530119999998,25.209681283999998,3.3701740132000002,18.604140219000001,31.815222349999999,15.099159244999999,35.320203323999998]
["2018 and 2019","Level 2/3 (<300 births)","Ayr",166,166,"NCMI_0700","NCMI: Non-instrumental vaginal birth for selected females giving birth for the first time",20,43,1321,2235,46.511627906999998,59.105145413999999,7.4974357275000001,44.410171388000002,73.800119440000003,36.612838230999998,81.597452595999997]
["2018 and 2019","Level 2/3 (<300 births)","Ayr",166,166,"NCMI_1500","NCMI: Females having their second birth vaginally whose first birth was by caesarean section",1,18,72,568,5.5555555555999998,12.676056338,7.8419216377999996,-2.694110072,28.046222748000002,-10.84970858,36.201821250999998]
["2018 and 2019","Level 2/3 (<300 births)","Biloela",117,117,"NCMI_0500","NCMI: Induction of labour for selected females giving birth for the first time",7,33,767,2235,21.212121212,34.317673378000002,8.2646832268000008,18.118894253000001,50.516452502999996,9.5236236974999997,59.111723058999999]
["2018 and 2019","Level 2/3 (<300 births)","Biloela",117,117,"NCMI_0500_A","Modified NCMI: Induction of labour for all females giving birth",14,117,2339,8346,11.965811966,28.025401389999999,4.1521459963999998,19.887195237,36.163607542999998,15.568963401,40.481839379]
["2018 and 2019","Level 2/3 (<300 births)","Biloela",117,117,"NCMI_0600","NCMI: Caesarean section for selected females giving birth for the first time",8,33,558,2235,24.242424241999998,24.966442953000001,7.5344079849999996,10.199003301999999,39.733882604000001,2.3632189980999998,47.569666908000002]
["2018 and 2019","Level 2/3 (<300 births)","Biloela",117,117,"NCMI_0600_A","Modified NCMI: Caesarean section for all females giving birth",25,117,2104,8346,21.367521367999998,25.209681283999998,4.0143333982999998,17.341587824000001,33.077774744999999,13.166681090000001,37.252681479000003]
["2018 and 2019","Level 2/3 (<300 births)","Biloela",117,117,"NCMI_0700","NCMI: Non-instrumental vaginal birth for selected females giving birth for the first time",21,33,1321,2235,63.636363635999999,59.105145413999999,8.5583493293000004,42.330780728000001,75.879510099000001,33.430097426000003,84.780193401999995]
["2018 and 2019","Level 2/3 (<300 births)","Charleville",95,96,"NCMI_0500","NCMI: Induction of labour for selected females giving birth for the first time",11,27,767,2235,40.740740741000003,34.317673378000002,9.1369510915000003,16.409249239000001,52.226097516999999,6.9068201035000003,61.728526653000003]
["2018 and 2019","Level 2/3 (<300 births)","Charleville",95,96,"NCMI_0500_A","Modified NCMI: Induction of labour for all females giving birth",30,95,2339,8346,31.578947368000001,28.025401389999999,4.6079074094000001,18.993902866999999,37.056899911999999,14.201679162,41.849123618]
["2018 and 2019","Level 2/3 (<300 births)","Charleville",95,96,"NCMI_0600","NCMI: Caesarean section for selected females giving birth for the first time",8,27,558,2235,29.62962963,24.966442953000001,8.3296014345000007,8.6404241413000005,41.292461764999999,-2.2361351000000002E-2,49.955247257000003]
["2018 and 2019","Level 2/3 (<300 births)","Charleville",95,96,"NCMI_0600_A","Modified NCMI: Caesarean section for all females giving birth",27,95,2104,8346,28.421052631999999,25.209681283999998,4.4549677747,16.477944445999999,33.941418122999998,11.84477796,38.574584608999999]
["2018 and 2019","Level 2/3 (<300 births)","Charleville",95,96,"NCMI_0700","NCMI: Non-instrumental vaginal birth for selected females giving birth for the first time",15,27,1321,2235,55.555555556000002,59.105145413999999,9.4616111834000005,40.560387495000001,77.649903332999997,30.720311863999999,87.489978964000002]
["2018 and 2019","Level 2/3 (<300 births)","Cooktown",72,72,"NCMI_0500","NCMI: Induction of labour for selected females giving birth for the first time",3,24,767,2235,12.5,34.317673378000002,9.6912001143000008,15.322921153999999,53.312425601999998,5.2440730351999996,63.391273720999997]
["2018 and 2019","Level 2/3 (<300 births)","Cooktown",72,72,"NCMI_0500_A","Modified NCMI: Induction of labour for all females giving birth",12,72,2339,8346,16.666666667000001,28.025401389999999,5.2929683647000001,17.651183395,38.399619385000001,12.146496296,43.904306484000003]
["2018 and 2019","Level 2/3 (<300 births)","Cooktown",72,72,"NCMI_0600","NCMI: Caesarean section for selected females giving birth for the first time",4,24,558,2235,16.666666667000001,24.966442953000001,8.8348764884000008,7.6500850357000001,42.282800870000003,-1.538186512,51.471072417999999]
["2018 and 2019","Level 2/3 (<300 births)","Cooktown",72,72,"NCMI_0600_A","Modified NCMI: Caesarean section for all females giving birth",15,72,2104,8346,20.833333332999999,25.209681283999998,5.1172910828999996,15.179790762,35.239571806999997,9.8578080355999997,40.561554532999999]
["2018 and 2019","Level 2/3 (<300 births)","Cooktown",72,72,"NCMI_0700","NCMI: Non-instrumental vaginal birth for selected females giving birth for the first time",15,24,1321,2235,62.5,59.105145413999999,10.035554143000001,39.435459293000001,78.774831534,28.998482984999999,89.211807843000003]
["2018 and 2019","Level 2/3 (<300 births)","Goondiwindi",238,238,"NCMI_0500","NCMI: Induction of labour for selected females giving birth for the first time",14,70,767,2235,20,34.317673378000002,5.6745857391000003,23.195485329,45.439861426999997,17.293916160999999,51.341430594999999]
["2018 and 2019","Level 2/3 (<300 births)","Goondiwindi",238,238,"NCMI_0500_A","Modified NCMI: Induction of labour for all females giving birth",55,238,2339,8346,23.109243697,28.025401389999999,2.9112336869000002,22.319383364,33.731419416000001,19.291700329000001,36.75910245]
["2018 and 2019","Level 2/3 (<300 births)","Goondiwindi",238,238,"NCMI_0600","NCMI: Caesarean section for selected females giving birth for the first time",23,70,558,2235,32.857142856999999,24.966442953000001,5.1731739657000002,14.82702198,35.105863925999998,9.4469210558000007,40.485964850000002]
["2018 and 2019","Level 2/3 (<300 births)","Goondiwindi",238,238,"NCMI_0600_A","Modified NCMI: Caesarean section for all females giving birth",64,238,2104,8346,26.890756303,25.209681283999998,2.8146078268000001,19.693049943999998,30.726312624999998,16.765857803999999,33.653504765000001]
["2018 and 2019","Level 2/3 (<300 births)","Goondiwindi",238,238,"NCMI_0700","NCMI: Non-instrumental vaginal birth for selected females giving birth for the first time",32,70,1321,2235,45.714285713999999,59.105145413999999,5.8762188122000003,47.587756542000001,70.622534286000004,41.476488977000002,76.733801850000006]
["2018 and 2019","Level 2/3 (<300 births)","Goondiwindi",238,238,"NCMI_1500","NCMI: Females having their second birth vaginally whose first birth was by caesarean section",2,15,72,568,13.333333333000001,12.676056338,8.5903947503999998,-4.1611173729999997,29.513230049000001,-13.09512791,38.447240589000003]
["2018 and 2019","Level 2/3 (<300 births)","Ingham",88,88,"NCMI_0500","NCMI: Induction of labour for selected females giving birth for the first time",4,25,767,2235,16,34.317673378000002,9.4953981101,15.706693081999999,52.928653674000003,5.8314790478000003,62.803867707999999]
["2018 and 2019","Level 2/3 (<300 births)","Ingham",88,88,"NCMI_0500_A","Modified NCMI: Induction of labour for all females giving birth",12,88,2339,8346,13.636363636,28.025401389999999,4.7876700253999998,18.64156814,37.409234640000001,13.662391314000001,42.388411466000001]
["2018 and 2019","Level 2/3 (<300 births)","Ingham",88,88,"NCMI_0600","NCMI: Caesarean section for selected females giving birth for the first time",2,25,558,2235,8,24.966442953000001,8.6563757348999992,7.9999465127000002,41.932939392999998,-1.0026842520000001,50.935570157999997]
["2018 and 2019","Level 2/3 (<300 births)","Ingham",88,88,"NCMI_0600_A","Modified NCMI: Caesarean section for all females giving birth",10,88,2104,8346,11.363636364,25.209681283999998,4.6287639450000002,16.137303952,34.282058616999997,11.323389449,39.095973119999996]
["2018 and 2019","Level 2/3 (<300 births)","Ingham",88,88,"NCMI_0700","NCMI: Non-instrumental vaginal birth for selected females giving birth for the first time",20,25,1321,2235,80,59.105145413999999,9.8327947746,39.832867655999998,78.377423171999993,29.606761089999999,88.603529738000006]
["2018 and 2019","Level 2/3 (<300 births)","Longreach",122,123,"NCMI_0500","NCMI: Induction of labour for selected females giving birth for the first time",8,33,767,2235,24.242424241999998,34.317673378000002,8.2646832268000008,18.118894253000001,50.516452502999996,9.5236236974999997,59.111723058999999]
["2018 and 2019","Level 2/3 (<300 births)","Longreach",122,123,"NCMI_0500_A","Modified NCMI: Induction of labour for all females giving birth",31,122,2339,8346,25.409836066,28.025401389999999,4.0661709300000002,20.055706366999999,35.995096412999999,15.8268886,40.223914180000001]
["2018 and 2019","Level 2/3 (<300 births)","Longreach",122,123,"NCMI_0600","NCMI: Caesarean section for selected females giving birth for the first time",10,33,558,2235,30.303030303,24.966442953000001,7.5344079849999996,10.199003301999999,39.733882604000001,2.3632189980999998,47.569666908000002]
["2018 and 2019","Level 2/3 (<300 births)","Longreach",122,123,"NCMI_0600_A","Modified NCMI: Caesarean section for all females giving birth",40,122,2104,8346,32.786885245999997,25.209681283999998,3.9312119038,17.504505952999999,32.914856616000002,13.416045573,37.003316996000002]
["2018 and 2019","Level 2/3 (<300 births)","Longreach",122,123,"NCMI_0700","NCMI: Non-instrumental vaginal birth for selected females giving birth for the first time",16,33,1321,2235,48.484848485000001,59.105145413999999,8.5583493293000004,42.330780728000001,75.879510099000001,33.430097426000003,84.780193401999995]
["2018 and 2019","Level 2/3 (<300 births)","Longreach",122,123,"NCMI_1500","NCMI: Females having their second birth vaginally whose first birth was by caesarean section",1,10,72,568,10,12.676056338,10.521041914,-7.9451858130000002,33.297298488999999,-18.887069400000001,44.239182079000003]
["2018 and 2019","Level 2/3 (<300 births)","Roma",253,253,"NCMI_0500","NCMI: Induction of labour for selected females giving birth for the first time",23,71,767,2235,32.394366196999997,34.317673378000002,5.6344821570999999,23.27408835,45.361258405999997,17.414226907,51.221119850000001]
["2018 and 2019","Level 2/3 (<300 births)","Roma",253,253,"NCMI_0500_A","Modified NCMI: Induction of labour for all females giving birth",60,253,2339,8346,23.715415019999998,28.025401389999999,2.8236137359,22.491118468,33.559684312000002,19.554560181999999,36.496242596999998]
["2018 and 2019","Level 2/3 (<300 births)","Roma",253,253,"NCMI_0600","NCMI: Caesarean section for selected females giving birth for the first time",14,71,558,2235,19.718309859000001,24.966442953000001,5.1366139743000003,14.898679563,35.034206343000001,9.5566010301999995,40.376284876]
["2018 and 2019","Level 2/3 (<300 births)","Roma",253,253,"NCMI_0600_A","Modified NCMI: Caesarean section for all females giving birth",73,253,2104,8346,28.853754940999998,25.209681283999998,2.7298960425000001,19.859085041,30.560277528,17.019993156999998,33.399369411999999]
["2018 and 2019","Level 2/3 (<300 births)","Roma",253,253,"NCMI_0700","NCMI: Non-instrumental vaginal birth for selected females giving birth for the first time",46,71,1321,2235,64.788732393999993,59.105145413999999,5.8346902435999999,47.669152535999999,70.541138290999996,41.601074683,76.609216145000005]
["2018 and 2019","Level 2/3 (<300 births)","Roma",253,253,"NCMI_1500","NCMI: Females having their second birth vaginally whose first birth was by caesarean section",5,20,72,568,25,12.676056338,7.4395000824000004,-1.9053638230000001,27.257476499999999,-9.6424439090000007,34.994556584999998]
["2018 and 2019","Level 2/3 (<300 births)","St George",75,75,"NCMI_0500","NCMI: Induction of labour for selected females giving birth for the first time",3,20,767,2235,15,34.317673378000002,10.616177823999999,13.509964843000001,55.125381912999998,2.4691399067000002,66.166206849000005]
["2018 and 2019","Level 2/3 (<300 births)","St George",75,75,"NCMI_0500_A","Modified NCMI: Induction of labour for all females giving birth",11,75,2339,8346,14.666666666999999,28.025401389999999,5.1860286873000003,17.860785162999999,38.190017617000002,12.467315328,43.583487452]
["2018 and 2019","Level 2/3 (<300 births)","St George",75,75,"NCMI_0600","NCMI: Caesarean section for selected females giving birth for the first time",8,20,558,2235,40,24.966442953000001,9.6781222909999993,5.9973232627000002,43.935562642999997,-4.0679239200000001,54.000809826000001]
["2018 and 2019","Level 2/3 (<300 births)","St George",75,75,"NCMI_0600_A","Modified NCMI: Caesarean section for all females giving birth",29,75,2104,8346,38.666666667000001,25.209681283999998,5.0139008073999998,15.382435702,35.036926866999998,10.167978862,40.251383707000002]
["2018 and 2019","Level 2/3 (<300 births)","St George",75,75,"NCMI_0700","NCMI: Non-instrumental vaginal birth for selected females giving birth for the first time",11,20,1321,2235,55,59.105145413999999,10.993398762,37.558083840000002,80.652206988000003,26.124949127000001,92.085341701000004]
["2018 and 2019","Level 2/3 (<300 births)","Stanthorpe",173,173,"NCMI_0500","NCMI: Induction of labour for selected females giving birth for the first time",15,51,767,2235,29.411764706,34.317673378000002,6.6481084316999999,21.287380851999998,47.347965903999999,14.373348083,54.261998673000001]
["2018 and 2019","Level 2/3 (<300 births)","Stanthorpe",173,173,"NCMI_0500_A","Modified NCMI: Induction of labour for all females giving birth",36,173,2339,8346,20.809248555,28.025401389999999,3.4146209058000001,21.332744415000001,34.718058364999997,17.781538673,38.269264106999998]
["2018 and 2019","Level 2/3 (<300 births)","Stanthorpe",173,173,"NCMI_0600","NCMI: Caesarean section for selected females giving birth for the first time",14,51,558,2235,27.450980392000002,24.966442953000001,6.0606752707,13.087519422,36.845366484000003,6.7844171408999996,43.148468764999997]
["2018 and 2019","Level 2/3 (<300 births)","Stanthorpe",173,173,"NCMI_0600_A","Modified NCMI: Caesarean section for all females giving birth",39,173,2104,8346,22.543352600999999,25.209681283999998,3.3012872756,18.739158224000001,31.680204345,15.305819458,35.113543110999998]
["2018 and 2019","Level 2/3 (<300 births)","Stanthorpe",173,173,"NCMI_0700","NCMI: Non-instrumental vaginal birth for selected females giving birth for the first time",31,51,1321,2235,60.784313724999997,59.105145413999999,6.8843333466000001,45.611852055,72.598438772999998,38.452145373999997,79.758145454000001]
["2018 and 2019","Level 2/3 (<300 births)","Stanthorpe",173,173,"NCMI_1500","NCMI: Females having their second birth vaginally whose first birth was by caesarean section",1,9,72,568,11.111111111,12.676056338,11.090151935,-9.0606414550000007,34.412754131,-20.594399469999999,45.946512144000003]
["2018 and 2019","Level 2/3 (<300 births)","Thursday Island",247,248,"NCMI_0500","NCMI: Induction of labour for selected females giving birth for the first time",11,43,767,2235,25.581395349000001,34.317673378000002,7.2401731826000004,20.126933940000001,48.508412816000003,12.59715383,56.038192926000001]
["2018 and 2019","Level 2/3 (<300 births)","Thursday Island",247,248,"NCMI_0500_A","Modified NCMI: Induction of labour for all females giving birth",59,247,2339,8346,23.886639676000001,28.025401389999999,2.8577028627000001,22.424303778999999,33.626499000999999,19.452292801999999,36.598509978000003]
["2018 and 2019","Level 2/3 (<300 births)","Thursday Island",247,248,"NCMI_0600","NCMI: Caesarean section for selected females giving birth for the first time",10,43,558,2235,23.255813953000001,24.966442953000001,6.6004246191,12.029610699999999,37.903275207,5.1651690955999996,44.767716810000003]
["2018 and 2019","Level 2/3 (<300 births)","Thursday Island",247,248,"NCMI_0600_A","Modified NCMI: Caesarean section for all females giving birth",61,247,2104,8346,24.696356274999999,25.209681283999998,2.7628537277,19.794487977999999,30.624874591000001,16.921120101,33.498242466999997]
["2018 and 2019","Level 2/3 (<300 births)","Thursday Island",247,248,"NCMI_0700","NCMI: Non-instrumental vaginal birth for selected females giving birth for the first time",24,43,1321,2235,55.813953488000003,59.105145413999999,7.4974357275000001,44.410171388000002,73.800119440000003,36.612838230999998,81.597452595999997]
["2018 and 2019","Level 4/5","Bundaberg",1929,1951,"NCMI_0500","NCMI: Induction of labour for selected females giving birth for the first time",215,533,5091,12227,40.337711069000001,41.637359941,2.1352338832000002,37.45230153,45.822418352,35.231658291999999,48.043061590999997]
["2018 and 2019","Level 4/5","Bundaberg",1929,1951,"NCMI_0500_A","Modified NCMI: Induction of labour for all females giving birth",622,1929,15334,46251,32.244686366000003,33.153877754,1.0718627085000001,31.053026845000002,35.254728663000002,29.938289629,36.369465879000003]
["2018 and 2019","Level 4/5","Bundaberg",1929,1951,"NCMI_0600","NCMI: Caesarean section for selected females giving birth for the first time",136,533,3131,12227,25.515947467,25.607262616,1.8905285615,21.901826634999999,29.312698596000001,19.935676931,31.2788483]
["2018 and 2019","Level 4/5","Bundaberg",1929,1951,"NCMI_0600_A","Modified NCMI: Caesarean section for all females giving birth",566,1929,13890,46251,29.341627786,30.031783097000002,1.0436979937999999,27.986135029,32.077431163999996,26.900689114999999,33.162877078000001]
["2018 and 2019","Level 4/5","Bundaberg",1929,1951,"NCMI_0700","NCMI: Non-instrumental vaginal birth for selected females giving birth for the first time",290,533,6486,12227,54.409005628999999,53.046536353999997,2.1617164572999998,48.809572097999997,57.283500609999997,46.561386982000002,59.531685725999999]
["2018 and 2019","Level 4/5","Bundaberg",1929,1951,"NCMI_1500","NCMI: Females having their second birth vaginally whose first birth was by caesarean section",33,192,707,3765,17.1875,18.778220451999999,2.8184663400000001,13.254026424999999,24.302414477999999,10.322821432,27.233619471000001]
["2018 and 2019","Level 4/5","Caboolture",3714,3749,"NCMI_0500","NCMI: Induction of labour for selected females giving birth for the first time",456,979,5091,12227,46.578140959999999,41.637359941,1.5754974736,38.549384893000003,44.725334988999997,36.910867519999996,46.363852362000003]
["2018 and 2019","Level 4/5","Caboolture",3714,3749,"NCMI_0500_A","Modified NCMI: Induction of labour for all females giving birth",1420,3714,15334,46251,38.233710285000001,33.153877754,0.77247480889999998,31.639827128,34.667928379999999,30.836453327000001,35.471302180999999]
["2018 and 2019","Level 4/5","Caboolture",3714,3749,"NCMI_0600","NCMI: Caesarean section for selected females giving birth for the first time",213,979,3131,12227,21.756894791000001,25.607262616,1.3949399154,22.873180381000001,28.341344849999999,21.422442869000001,29.792082361999999]
["2018 and 2019","Level 4/5","Caboolture",3714,3749,"NCMI_0600_A","Modified NCMI: Caesarean section for all females giving birth",1001,3714,13890,46251,26.952073236,30.031783097000002,0.75217693640000005,28.557516301,31.506049892,27.775252287000001,32.288313905999999]
["2018 and 2019","Level 4/5","Caboolture",3714,3749,"NCMI_0700","NCMI: Non-instrumental vaginal birth for selected females giving birth for the first time",586,979,6486,12227,59.856996936000002,53.046536353999997,1.5950378288,49.920262209000001,56.172810497999997,48.261422867,57.831649839999997]
["2018 and 2019","Level 4/5","Caboolture",3714,3749,"NCMI_1500","NCMI: Females having their second birth vaginally whose first birth was by caesarean section",55,278,707,3765,19.784172662,18.778220451999999,2.3422921826000001,14.187327774,23.369113128999999,11.751343904000001,25.805096999]
["2018 and 2019","Level 4/5","Cairns",4430,4504,"NCMI_0500","NCMI: Induction of labour for selected females giving birth for the first time",398,1056,5091,12227,37.689393938999999,41.637359941,1.5169703694000001,38.664098017000001,44.610621864999999,37.086448832999999,46.188271049000001]
["2018 and 2019","Level 4/5","Cairns",4430,4504,"NCMI_0500_A","Modified NCMI: Induction of labour for all females giving birth",1349,4430,15334,46251,30.451467268999998,33.153877754,0.7072995996,31.767570539000001,34.540184969000002,31.031978955,35.275776553]
["2018 and 2019","Level 4/5","Cairns",4430,4504,"NCMI_0600","NCMI: Caesarean section for selected females giving birth for the first time",250,1056,3131,12227,23.674242423999999,25.607262616,1.3431202233999999,22.974746977999999,28.239778253000001,21.577901945000001,29.636623285999999]
["2018 and 2019","Level 4/5","Cairns",4430,4504,"NCMI_0600_A","Modified NCMI: Caesarean section for all females giving birth",1372,4430,13890,46251,30.970654627999998,30.031783097000002,0.68871429819999996,28.681903072000001,31.381663120999999,27.965640201999999,32.097925990999997]
["2018 and 2019","Level 4/5","Cairns",4430,4504,"NCMI_0700","NCMI: Non-instrumental vaginal birth for selected females giving birth for the first time",575,1056,6486,12227,54.450757576000001,53.046536353999997,1.5357848329999999,50.036398081000002,56.056674627,48.439181855000001,57.653890853]
["2018 and 2019","Level 4/5","Cairns",4430,4504,"NCMI_1500","NCMI: Females having their second birth vaginally whose first birth was by caesarean section",71,399,707,3765,17.794486215999999,18.778220451999999,1.9551362097,14.94615348,22.610287422999999,12.912811822,24.643629081]
["2018 and 2019","Level 4/5","Hervey Bay",1601,1618,"NCMI_0500","NCMI: Induction of labour for selected females giving birth for the first time",148,367,5091,12227,40.326975476999998,41.637359941,2.5732147068,36.593859115999997,46.680860766000002,33.917715821000002,49.357004060999998]
["2018 and 2019","Level 4/5","Hervey Bay",1601,1618,"NCMI_0500_A","Modified NCMI: Induction of labour for all females giving birth",533,1601,15334,46251,33.291692691999998,33.153877754,1.1765478900999999,30.847843889,35.459911619000003,29.624234084000001,36.683521423999998]
["2018 and 2019","Level 4/5","Hervey Bay",1601,1618,"NCMI_0600","NCMI: Caesarean section for selected females giving birth for the first time",81,367,3131,12227,22.070844687000001,25.607262616,2.2783152404,21.141764744,30.072760487,18.772316893999999,32.442208336999997]
["2018 and 2019","Level 4/5","Hervey Bay",1601,1618,"NCMI_0600_A","Modified NCMI: Caesarean section for all females giving birth",444,1601,13890,46251,27.732667082999999,30.031783097000002,1.1456324235999999,27.786343546000001,32.277222647000002,26.594885825999999,33.468680366999997]
["2018 and 2019","Level 4/5","Hervey Bay",1601,1618,"NCMI_0700","NCMI: Non-instrumental vaginal birth for selected females giving birth for the first time",190,367,6486,12227,51.771117166000003,53.046536353999997,2.6051294069000002,47.940482715999998,58.152589992000003,45.231148132999998,60.861924575000003]
["2018 and 2019","Level 4/5","Hervey Bay",1601,1618,"NCMI_1500","NCMI: Females having their second birth vaginally whose first birth was by caesarean section",20,111,707,3765,18.018018017999999,18.778220451999999,3.7068240964000001,11.512845222999999,26.043595679999999,7.6577481624999999,29.898692741000001]
["2018 and 2019","Level 4/5","Ipswich",5281,5354,"NCMI_0500","NCMI: Induction of labour for selected females giving birth for the first time",560,1294,5091,12227,43.276661515000001,41.637359941,1.3703828624000001,38.951409531000003,44.323310351000003,37.526211353999997,45.748508528000002]
["2018 and 2019","Level 4/5","Ipswich",5281,5354,"NCMI_0500_A","Modified NCMI: Induction of labour for all females giving birth",1705,5281,15334,46251,32.285551978999997,33.153877754,0.64780931949999998,31.884171488,34.42358402,31.210449794999999,35.097305712999997]
["2018 and 2019","Level 4/5","Ipswich",5281,5354,"NCMI_0600","NCMI: Caesarean section for selected females giving birth for the first time",348,1294,3131,12227,26.893353941000001,25.607262616,1.2133321609000001,23.229131580000001,27.985393650999999,21.967266132999999,29.247259098000001]
["2018 and 2019","Level 4/5","Ipswich",5281,5354,"NCMI_0600_A","Modified NCMI: Caesarean section for all females giving birth",1499,5281,13890,46251,28.384775610999998,30.031783097000002,0.63078720980000003,28.795440164999999,31.268126028000001,28.139421466999998,31.924144726000002]
["2018 and 2019","Level 4/5","Ipswich",5281,5354,"NCMI_0700","NCMI: Non-instrumental vaginal birth for selected females giving birth for the first time",679,1294,6486,12227,52.472952087000003,53.046536353999997,1.3873792514000001,50.327273021000003,55.765799686999998,48.884398599999997,57.208674107999997]
["2018 and 2019","Level 4/5","Ipswich",5281,5354,"NCMI_1500","NCMI: Females having their second birth vaginally whose first birth was by caesarean section",76,366,707,3765,20.765027322000002,18.778220451999999,2.0413756222999999,14.777124232,22.779316671,12.654093585,24.902347318]
["2018 and 2019","Level 4/5","Logan",7076,7157,"NCMI_0500","NCMI: Induction of labour for selected females giving birth for the first time",806,1742,5091,12227,46.268656716000002,41.637359941,1.1810954097999999,39.322412937999999,43.952306944,38.094073711999997,45.180646170000003]
["2018 and 2019","Level 4/5","Logan",7076,7157,"NCMI_0500_A","Modified NCMI: Induction of labour for all females giving birth",2580,7076,15334,46251,36.461277557999999,33.153877754,0.55964337009999998,32.056976749,34.250778758999999,31.474947644,34.832807864000003]
["2018 and 2019","Level 4/5","Logan",7076,7157,"NCMI_0600","NCMI: Caesarean section for selected females giving birth for the first time",503,1742,3131,12227,28.874856486999999,25.607262616,1.0457377168999999,23.55761669,27.656908541,22.470049464999999,28.744475766000001]
["2018 and 2019","Level 4/5","Logan",7076,7157,"NCMI_0600_A","Modified NCMI: Caesarean section for all females giving birth",2168,7076,13890,46251,30.638778971000001,30.031783097000002,0.5449379459,28.963704722999999,31.09986147,28.396969258999999,31.666596934000001]
["2018 and 2019","Level 4/5","Logan",7076,7157,"NCMI_0700","NCMI: Non-instrumental vaginal birth for selected females giving birth for the first time",865,1742,6486,12227,49.655568312,53.046536353999997,1.1957441313999999,50.702877856000001,55.390194850999997,49.45930396,56.633768748000001]
["2018 and 2019","Level 4/5","Logan",7076,7157,"NCMI_1500","NCMI: Females having their second birth vaginally whose first birth was by caesarean section",95,508,707,3765,18.700787402,18.778220451999999,1.7327328568,15.382064052,22.174376851000002,13.580021881,23.976419022000002]
["2018 and 2019","Level 4/5","Mackay",2750,2780,"NCMI_0500","NCMI: Induction of labour for selected females giving birth for the first time",336,784,5091,12227,42.857142856999999,41.637359941,1.7605607914000001,38.186660789999998,45.088059092000002,36.355677567000001,46.919042314999999]
["2018 and 2019","Level 4/5","Mackay",2750,2780,"NCMI_0500_A","Modified NCMI: Induction of labour for all females giving birth",916,2750,15334,46251,33.309090908999998,33.153877754,0.89771592290000002,31.394354544999999,34.913400963000001,30.460729985,35.847025522999999]
["2018 and 2019","Level 4/5","Mackay",2750,2780,"NCMI_0600","NCMI: Caesarean section for selected females giving birth for the first time",155,784,3131,12227,19.770408162999999,25.607262616,1.5587943253000001,22.552025738000001,28.662499492999999,20.930879640000001,30.283645590999999]
["2018 and 2019","Level 4/5","Mackay",2750,2780,"NCMI_0600_A","Modified NCMI: Caesarean section for all females giving birth",720,2750,13890,46251,26.181818182000001,30.031783097000002,0.87412716229999998,28.318493858,31.745072335,27.40940161,32.654164584]
["2018 and 2019","Level 4/5","Mackay",2750,2780,"NCMI_0700","NCMI: Non-instrumental vaginal birth for selected females giving birth for the first time",421,784,6486,12227,53.698979592000001,53.046536353999997,1.7823964235,49.553039364,56.540033344000001,47.699347082999999,58.393725623999998]
["2018 and 2019","Level 4/5","Mackay",2750,2780,"NCMI_1500","NCMI: Females having their second birth vaginally whose first birth was by caesarean section",40,212,707,3765,18.867924528,18.778220451999999,2.6822270401999999,13.521055453000001,24.03538545,10.731539331,26.824901572000002]
["2018 and 2019","Level 4/5","Redcliffe",3223,3254,"NCMI_0500","NCMI: Induction of labour for selected females giving birth for the first time",345,851,5091,12227,40.540540540999999,41.637359941,1.6898349064,38.325283525000003,44.949436358,36.567855221999999,46.706864660000001]
["2018 and 2019","Level 4/5","Redcliffe",3223,3254,"NCMI_0500_A","Modified NCMI: Induction of labour for all females giving birth",1019,3223,15334,46251,31.616506360999999,33.153877754,0.82923022319999995,31.528586517000001,34.779168990999999,30.666187084000001,35.641568423999999]
["2018 and 2019","Level 4/5","Redcliffe",3223,3254,"NCMI_0600","NCMI: Caesarean section for selected females giving birth for the first time",224,851,3131,12227,26.321974147999999,25.607262616,1.4961738758000001,22.674761819,28.539763411999999,21.118740987999999,30.095784243000001]
["2018 and 2019","Level 4/5","Redcliffe",3223,3254,"NCMI_0600_A","Modified NCMI: Caesarean section for all females giving birth",1015,3223,13890,46251,31.492398387000001,30.031783097000002,0.80744102159999998,28.449198694,31.614367499,27.609460032000001,32.454106160999999]
["2018 and 2019","Level 4/5","Redcliffe",3223,3254,"NCMI_0700","NCMI: Non-instrumental vaginal birth for selected females giving birth for the first time",432,851,6486,12227,50.763807286000002,53.046536353999997,1.7107933496000001,49.693381389000002,56.399691318999999,47.914156304999999,58.178916403000002]
["2018 and 2019","Level 4/5","Redcliffe",3223,3254,"NCMI_1500","NCMI: Females having their second birth vaginally whose first birth was by caesarean section",46,310,707,3765,14.838709677000001,18.778220451999999,2.2181076516,14.430729454,23.125711449000001,12.123897497,25.432543406000001]
["2018 and 2019","Level 4/5","Redland",3581,3617,"NCMI_0500","NCMI: Induction of labour for selected females giving birth for the first time",506,1055,5091,12227,47.962085307999999,41.637359941,1.5176891424000001,38.662689221999997,44.612030660000002,37.084292513999998,46.190427368000002]
["2018 and 2019","Level 4/5","Redland",3581,3617,"NCMI_0500_A","Modified NCMI: Induction of labour for all females giving birth",1262,3581,15334,46251,35.241552638999998,33.153877754,0.7866890674,31.611967182000001,34.695788325999999,30.793810552,35.513944956000003]
["2018 and 2019","Level 4/5","Redland",3581,3617,"NCMI_0600","NCMI: Caesarean section for selected females giving birth for the first time",335,1055,3131,12227,31.753554502,25.607262616,1.3437566224999999,22.973499635,28.241025596,21.575992748000001,29.638532482999999]
["2018 and 2019","Level 4/5","Redland",3581,3617,"NCMI_0600_A","Modified NCMI: Caesarean section for all females giving birth",1236,3581,13890,46251,34.515498463999997,30.031783097000002,0.76601769500000005,28.530388414000001,31.533177778999999,27.733730010999999,32.329836182000001]
["2018 and 2019","Level 4/5","Redland",3581,3617,"NCMI_0700","NCMI: Non-instrumental vaginal birth for selected females giving birth for the first time",542,1055,6486,12227,51.374407583,53.046536353999997,1.5365125207000001,50.034971812999999,56.058100895000003,48.436998791999997,57.656073915999997]
["2018 and 2019","Level 4/5","Redland",3581,3617,"NCMI_1500","NCMI: Females having their second birth vaginally whose first birth was by caesarean section",41,345,707,3765,11.884057971000001,18.778220451999999,2.1025867311000002,14.657150459,22.899290443999998,12.470460257999999,25.085980644999999]
["2018 and 2019","Level 4/5","Rockhampton",2450,2477,"NCMI_0500","NCMI: Induction of labour for selected females giving birth for the first time",249,616,5091,12227,40.422077922,41.637359941,1.9861804412999999,37.744446275999998,45.530273606000002,35.678818616999997,47.595901265000002]
["2018 and 2019","Level 4/5","Rockhampton",2450,2477,"NCMI_0500_A","Modified NCMI: Induction of labour for all females giving birth",761,2450,15334,46251,31.061224490000001,33.153877754,0.95109135280000001,31.289738703000001,35.018016805000002,30.300603696,36.007151811999996]
["2018 and 2019","Level 4/5","Rockhampton",2450,2477,"NCMI_0600","NCMI: Caesarean section for selected females giving birth for the first time",137,616,3131,12227,22.240259739999999,25.607262616,1.7585571688999999,22.160490564,29.054034667,20.331591109000001,30.882934122000002]
["2018 and 2019","Level 4/5","Rockhampton",2450,2477,"NCMI_0600_A","Modified NCMI: Caesarean section for all females giving birth",675,2450,13890,46251,27.551020407999999,30.031783097000002,0.92610007699999997,28.216626946000002,31.846939247000002,27.253482865999999,32.810083327000001]
["2018 and 2019","Level 4/5","Rockhampton",2450,2477,"NCMI_0700","NCMI: Non-instrumental vaginal birth for selected females giving birth for the first time",353,616,6486,12227,57.305194804999999,53.046536353999997,2.0108143567000001,49.105340214999998,56.987732493000003,47.014093283999998,59.078979424000003]
["2018 and 2019","Level 4/5","Rockhampton",2450,2477,"NCMI_1500","NCMI: Females having their second birth vaginally whose first birth was by caesarean section",43,181,707,3765,23.756906077,18.778220451999999,2.9028472228000002,13.088639895,24.467801007999999,10.069678783000001,27.486762120000002]
["2018 and 2019","Level 4/5","Sunshine Coast University Hospital",6258,6354,"NCMI_0500","NCMI: Induction of labour for selected females giving birth for the first time",644,1960,5091,12227,32.857142856999999,41.637359941,1.113476412,39.454946174,43.819773709000003,38.296930705000001,44.977789176999998]
["2018 and 2019","Level 4/5","Sunshine Coast University Hospital",6258,6354,"NCMI_0500_A","Modified NCMI: Induction of labour for all females giving birth",1849,6258,15334,46251,29.546180887999999,33.153877754,0.59509663690000003,31.987488345999999,34.320267162,31.368587843,34.939167664999999]
["2018 and 2019","Level 4/5","Sunshine Coast University Hospital",6258,6354,"NCMI_0600","NCMI: Caesarean section for selected females giving birth for the first time",438,1960,3131,12227,22.346938775999998,25.607262616,0.9858680943,23.674961151000002,27.539564080000002,22.649658333000001,28.564866898999998]
["2018 and 2019","Level 4/5","Sunshine Coast University Hospital",6258,6354,"NCMI_0600_A","Modified NCMI: Caesarean section for all females giving birth",1737,6258,13890,46251,27.756471716,30.031783097000002,0.57945962770000004,28.896042225999999,31.167523967000001,28.293404212999999,31.770161980000001]
["2018 and 2019","Level 4/5","Sunshine Coast University Hospital",6258,6354,"NCMI_0700","NCMI: Non-instrumental vaginal birth for selected females giving birth for the first time",996,1960,6486,12227,50.816326531000001,53.046536353999997,1.1272864783000001,50.837054856000002,55.256017851000003,49.664676919000001,56.428395789]
["2018 and 2019","Level 4/5","Sunshine Coast University Hospital",6258,6354,"NCMI_1500","NCMI: Females having their second birth vaginally whose first birth was by caesarean section",151,555,707,3765,27.207207207,18.778220451999999,1.6577421320000001,15.529045872999999,22.027395030000001,13.804994055,23.751446848000001]
["2018 and 2019","Level 4/5","Toowoomba",3958,4031,"NCMI_0500","NCMI: Induction of labour for selected females giving birth for the first time",428,990,5091,12227,43.232323231999999,41.637359941,1.5667202605999999,38.566588230000001,44.708131651999999,36.937199159000002,46.337520722999997]
["2018 and 2019","Level 4/5","Toowoomba",3958,4031,"NCMI_0500_A","Modified NCMI: Induction of labour for all females giving birth",1318,3958,15334,46251,33.299646285999998,33.153877754,0.74828558730000005,31.687238003000001,34.620517505000002,30.909020991999999,35.398734515999998]
["2018 and 2019","Level 4/5","Toowoomba",3958,4031,"NCMI_0600","NCMI: Caesarean section for selected females giving birth for the first time",311,990,3131,12227,31.414141413999999,25.607262616,1.3871686019,22.888412156000001,28.326113074999999,21.445756809999999,29.768768421000001]
["2018 and 2019","Level 4/5","Toowoomba",3958,4031,"NCMI_0600_A","Modified NCMI: Caesarean section for all females giving birth",1457,3958,13890,46251,36.811520969999997,30.031783097000002,0.72862332100000005,28.603681387999998,31.459884806000002,27.845913134,32.217653059]
["2018 and 2019","Level 4/5","Toowoomba",3958,4031,"NCMI_0700","NCMI: Non-instrumental vaginal birth for selected females giving birth for the first time",557,990,6486,12227,56.262626263000001,53.046536353999997,1.5861517550999999,49.937678914000003,56.155393793999998,48.288081089000002,57.804991618999999]
["2018 and 2019","Level 4/5","Toowoomba",3958,4031,"NCMI_1500","NCMI: Females having their second birth vaginally whose first birth was by caesarean section",36,308,707,3765,11.688311688000001,18.778220451999999,2.2252976467000001,14.416637064,23.139803838999999,12.102327511,25.454113392]
["2018 and 2019","Level 6","Gold Coast University Hospital",10009,10159,"NCMI_0500","NCMI: Induction of labour for selected females giving birth for the first time",1377,3208,4716,11139,42.92394015,42.337732291999998,0.87235343489999995,40.627919558999999,44.047545024000001,39.720671987000003,44.954792597000001]
["2018 and 2019","Level 6","Gold Coast University Hospital",10009,10159,"NCMI_0500_A","Modified NCMI: Induction of labour for all females giving birth",3535,10009,12101,36102,35.318213608000001,33.518918618999997,0.47184427759999997,32.594103834999999,34.443733404,32.103385787000001,34.934451451999998]
["2018 and 2019","Level 6","Gold Coast University Hospital",10009,10159,"NCMI_0600","NCMI: Caesarean section for selected females giving birth for the first time",769,3208,2947,11139,23.971321696,26.456593948999998,0.77879231260000004,24.930161016,27.983026882000001,24.120217011000001,28.792970886999999]
["2018 and 2019","Level 6","Gold Coast University Hospital",10009,10159,"NCMI_0600_A","Modified NCMI: Caesarean section for all females giving birth",3071,10009,11828,36102,30.682385853,32.762727826999999,0.469137042,31.843219223999998,33.682236429,31.355316701,34.170138952999999]
["2018 and 2019","Level 6","Gold Coast University Hospital",10009,10159,"NCMI_0700","NCMI: Non-instrumental vaginal birth for selected females giving birth for the first time",1623,3208,5396,11139,50.592269326999997,48.442409552000001,0.88235224469999995,46.712999152000002,50.171819952,45.795352817999998,51.089466285999997]
["2018 and 2019","Level 6","Gold Coast University Hospital",10009,10159,"NCMI_1500","NCMI: Females having their second birth vaginally whose first birth was by caesarean section",117,846,473,3263,13.829787233999999,14.495862703,1.2104041853,12.1234705,16.868254906000001,10.864650147000001,18.127075259000001]
["2018 and 2019","Level 6","Mater Mothers' Hospital",12066,12303,"NCMI_0500","NCMI: Induction of labour for selected females giving birth for the first time",1700,3711,4716,11139,45.809754783000002,42.337732291999998,0.81108090690000001,40.748013714000002,43.927450868999998,39.904489570999999,44.770975012999997]
["2018 and 2019","Level 6","Mater Mothers' Hospital",12066,12303,"NCMI_0500_A","Modified NCMI: Induction of labour for all females giving birth",4304,12066,12101,36102,35.670479032000003,33.518918618999997,0.42974652790000001,32.676615425000001,34.361221813999997,32.229679036,34.808158202999998]
["2018 and 2019","Level 6","Mater Mothers' Hospital",12066,12303,"NCMI_0600","NCMI: Caesarean section for selected females giving birth for the first time",937,3711,2947,11139,25.249258959999999,26.456593948999998,0.72409134870000003,25.037374906,27.875812993,24.284319903,28.628867995]
["2018 and 2019","Level 6","Mater Mothers' Hospital",12066,12303,"NCMI_0600_A","Modified NCMI: Caesarean section for all females giving birth",3880,12066,11828,36102,32.156472733000001,32.762727826999999,0.42728083080000001,31.925257397999999,33.600198255000002,31.480885334,34.044570319000002]
["2018 and 2019","Level 6","Mater Mothers' Hospital",12066,12303,"NCMI_0700","NCMI: Non-instrumental vaginal birth for selected females giving birth for the first time",1766,3711,5396,11139,47.588251145000001,48.442409552000001,0.8203774184,46.834469812000002,50.050349292,45.981277296999998,50.903541807000003]
["2018 and 2019","Level 6","Mater Mothers' Hospital",12066,12303,"NCMI_1500","NCMI: Females having their second birth vaginally whose first birth was by caesarean section",176,1129,473,3263,15.589016829,14.495862703,1.0477764362999999,12.442220888,16.549504517999999,11.352533394,17.639192011999999]
["2018 and 2019","Level 6","Royal Brisbane and Women's",9286,9488,"NCMI_0500","NCMI: Induction of labour for selected females giving birth for the first time",1110,2988,4716,11139,37.148594377999999,42.337732291999998,0.90389786110000003,40.566092484000002,44.109372100000002,39.626038708999999,45.049425874999997]
["2018 and 2019","Level 6","Royal Brisbane and Women's",9286,9488,"NCMI_0500_A","Modified NCMI: Induction of labour for all females giving birth",2706,9286,12101,36102,29.140641826,33.518918618999997,0.48986870690000001,32.558775953999998,34.479061285,32.049312499000003,34.988524740000003]
["2018 and 2019","Level 6","Royal Brisbane and Women's",9286,9488,"NCMI_0600","NCMI: Caesarean section for selected females giving birth for the first time",897,2988,2947,11139,30.020080320999998,26.456593948999998,0.80695355499999999,24.874964981000002,28.038222916999999,24.035733283999999,28.877454614000001]
["2018 and 2019","Level 6","Royal Brisbane and Women's",9286,9488,"NCMI_0600_A","Modified NCMI: Caesarean section for all females giving birth",3389,9286,11828,36102,36.495800129000003,32.762727826999999,0.4870580551,31.808094039,33.717361615000002,31.301553662,34.223901992000002]
["2018 and 2019","Level 6","Royal Brisbane and Women's",9286,9488,"NCMI_0700","NCMI: Non-instrumental vaginal birth for selected females giving birth for the first time",1402,2988,5396,11139,46.921017403,48.442409552000001,0.9142582293,46.650463422999998,50.234355680999997,45.699634863999997,51.185184239999998]
["2018 and 2019","Level 6","Royal Brisbane and Women's",9286,9488,"NCMI_1500","NCMI: Females having their second birth vaginally whose first birth was by caesarean section",96,895,473,3263,10.726256983000001,14.495862703,1.17680385,12.189327156999999,16.802398248999999,10.965451153,18.026274253]
["2018 and 2019","Level 6","Townsville",4741,4832,"NCMI_0500","NCMI: Induction of labour for selected females giving birth for the first time",529,1232,4716,11139,42.938311687999999,42.337732291999998,1.4076811703000001,39.578677198000001,45.096787386000003,38.114688780999998,46.560775802999999]
["2018 and 2019","Level 6","Townsville",4741,4832,"NCMI_0500_A","Modified NCMI: Induction of labour for all females giving birth",1556,4741,12101,36102,32.820080152000003,33.518918618999997,0.68558145189999997,32.175178973999998,34.862658265,31.462174264000002,35.575662975]
["2018 and 2019","Level 6","Townsville",4741,4832,"NCMI_0600","NCMI: Caesarean section for selected females giving birth for the first time",344,1232,2947,11139,27.922077922,26.456593948999998,1.2567054018999999,23.993451361000002,28.919736536999999,22.686477744000001,30.226710154999999]
["2018 and 2019","Level 6","Townsville",4741,4832,"NCMI_0600_A","Modified NCMI: Caesarean section for all females giving birth",1488,4741,11828,36102,31.385783589999999,32.762727826999999,0.68164788600000004,31.426697969999999,34.098757683000002,30.717784169000002,34.807671485]
["2018 and 2019","Level 6","Townsville",4741,4832,"NCMI_0700","NCMI: Non-instrumental vaginal birth for selected females giving birth for the first time",605,1232,5396,11139,49.107142856999999,48.442409552000001,1.423815842,45.651730501999999,51.233088602000002,44.170962025999998,52.713857077999997]
["2018 and 2019","Level 6","Townsville",4741,4832,"NCMI_1500","NCMI: Females having their second birth vaginally whose first birth was by caesarean section",84,393,473,3263,21.374045802000001,14.495862703,1.7759033359,11.015092165,17.976633240999998,9.1681526952999999,19.823572711000001]
["2018 and 2019","Queensland","Level 1",103,103,"NCMI_0600_A","Modified NCMI: Caesarean section for all females giving birth",3,103,42248,117987,2.9126213592000001,35.807334705999999,4.7240021824999996,26.548290429000001,45.066378984000004,21.635328159,49.979341253999998]
["2018 and 2019","Queensland","Level 2/3",8346,8366,"NCMI_0500","NCMI: Induction of labour for selected females giving birth for the first time",767,2235,13655,33315,34.317673378000002,40.987543148999997,1.040301028,38.948553134000001,43.026533164,37.866640064999999,44.108446233000002]
["2018 and 2019","Queensland","Level 2/3",8346,8366,"NCMI_0500_A","Modified NCMI: Induction of labour for all females giving birth",2339,8346,38124,117987,28.025401389999999,32.312034377000003,0.51191598579999997,31.308679044000002,33.315389709000002,30.776286419000002,33.847782334000001]
["2018 and 2019","Queensland","Level 2/3",8346,8366,"NCMI_0600","NCMI: Caesarean section for selected females giving birth for the first time",558,2235,10110,33315,24.966442953000001,30.346690679999998,0.97249590850000001,28.440598698999999,32.252782660999998,27.429202954000001,33.264178405000003]
["2018 and 2019","Queensland","Level 2/3",8346,8366,"NCMI_0600_A","Modified NCMI: Caesarean section for all females giving birth",2104,8346,42248,117987,25.209681283999998,35.807334705999999,0.52479478629999998,34.778736924999997,36.835932487000001,34.232950348000003,37.381719064999999]
["2018 and 2019","Queensland","Level 2/3",8346,8366,"NCMI_0700","NCMI: Non-instrumental vaginal birth for selected females giving birth for the first time",1321,2235,15614,33315,59.105145413999999,46.867777277999998,1.0555465903000001,44.798905959999999,48.936648595000001,43.701137506000002,50.034417048999998]
["2018 and 2019","Queensland","Level 2/3",8346,8366,"NCMI_1500","NCMI: Females having their second birth vaginally whose first birth was by caesarean section",72,568,1517,12538,12.676056338,12.099218376,1.3683615371,9.4172297634,14.781206988999999,7.9941337646999999,16.204302987999998]
["2018 and 2019","Queensland","Level 4/5",46251,46846,"NCMI_0500","NCMI: Induction of labour for selected females giving birth for the first time",5091,12227,13655,33315,41.637359941,40.987543148999997,0.44477240579999999,40.115789233000001,41.859297064000003,39.653225931000001,42.321860366000003]
["2018 and 2019","Queensland","Level 4/5",46251,46846,"NCMI_0500_A","Modified NCMI: Induction of labour for all females giving birth",15334,46251,38124,117987,33.153877754,32.312034377000003,0.21745896579999999,31.885814803999999,32.738253950000001,31.659657479,32.964411274]
["2018 and 2019","Queensland","Level 4/5",46251,46846,"NCMI_0600","NCMI: Caesarean section for selected females giving birth for the first time",3131,12227,10110,33315,25.607262616,30.346690679999998,0.41578286790000002,29.531756259000002,31.161625100999998,29.099342075999999,31.594039283000001]
["2018 and 2019","Queensland","Level 4/5",46251,46846,"NCMI_0600_A","Modified NCMI: Caesarean section for all females giving birth",13890,46251,42248,117987,30.031783097000002,35.807334705999999,0.22292980609999999,35.370392285999998,36.244277126,35.138545288000003,36.476124124999998]
["2018 and 2019","Queensland","Level 4/5",46251,46846,"NCMI_0700","NCMI: Non-instrumental vaginal birth for selected females giving birth for the first time",6486,12227,15614,33315,53.046536353999997,46.867777277999998,0.4512905244,45.983247849999998,47.752306705000002,45.513905704000003,48.221648850999998]
["2018 and 2019","Queensland","Level 4/5",46251,46846,"NCMI_1500","NCMI: Females having their second birth vaginally whose first birth was by caesarean section",707,3765,1517,12538,18.778220451999999,12.099218376,0.53148686479999996,11.057504120999999,13.140932631,10.504757782,13.693678971000001]
["2018 and 2019","Queensland","Level 6",36102,36782,"NCMI_0500","NCMI: Induction of labour for selected females giving birth for the first time",4716,11139,13655,33315,42.337732291999998,40.987543148999997,0.46598795320000003,40.074206760000003,41.900879537000002,39.589579289,42.385507007999998]
["2018 and 2019","Queensland","Level 6",36102,36782,"NCMI_0500_A","Modified NCMI: Induction of labour for all females giving birth",12101,36102,38124,117987,33.518918618999997,32.312034377000003,0.24613436350000001,31.829611023999998,32.794457729000001,31.573631286000001,33.050437467000002]
["2018 and 2019","Queensland","Level 6",36102,36782,"NCMI_0600","NCMI: Caesarean section for selected females giving birth for the first time",2947,11139,10110,33315,26.456593948999998,30.346690679999998,0.43561562059999998,29.492884063000002,31.200497296000002,29.039843818000001,31.653537541999999]
["2018 and 2019","Queensland","Level 6",36102,36782,"NCMI_0600_A","Modified NCMI: Caesarean section for all females giving birth",11828,36102,42248,117987,32.762727826999999,35.807334705999999,0.25232662049999999,35.312774529999999,36.301894881999999,35.050354845000001,36.564314568]
["2018 and 2019","Queensland","Level 6",36102,36782,"NCMI_0700","NCMI: Non-instrumental vaginal birth for selected females giving birth for the first time",5396,11139,15614,33315,48.442409552000001,46.867777277999998,0.47281698459999999,45.941055988000002,47.794498566999998,45.449326323999998,48.286228231000003]
["2018 and 2019","Queensland","Level 6",36102,36782,"NCMI_1500","NCMI: Females having their second birth vaginally whose first birth was by caesarean section",473,3263,1517,12538,14.495862703,12.099218376,0.57090847389999999,10.980237767,13.218198985000001,10.386492955,13.811943798]
["2018 and 2019","Queensland","Private",27185,27629,"NCMI_0500","NCMI: Induction of labour for selected females giving birth for the first time",3081,7705,13655,33315,39.987021415000001,40.987543148999997,0.56028819200000002,39.889378292000004,42.085708005000001,39.306678572999999,42.668407725000002]
["2018 and 2019","Queensland","Private",27185,27629,"NCMI_0500_A","Modified NCMI: Induction of labour for all females giving birth",8350,27185,38124,117987,30.715468089000002,32.312034377000003,0.28364374650000002,31.756092633000002,32.867976120000002,31.461103136999998,33.162965616000001]
["2018 and 2019","Queensland","Private",27185,27629,"NCMI_0600","NCMI: Caesarean section for selected females giving birth for the first time",3474,7705,10110,33315,45.087605451000002,30.346690679999998,0.52376952399999999,29.320102413000001,31.373278946999999,28.775382107999999,31.917999252000001]
["2018 and 2019","Queensland","Private",27185,27629,"NCMI_0600_A","Modified NCMI: Caesarean section for all females giving birth",14423,27185,42248,117987,53.054993562999996,35.807334705999999,0.29077966589999998,35.237406561,36.377262852000001,34.934995708999999,36.679673704000002]
["2018 and 2019","Queensland","Private",27185,27629,"NCMI_0700","NCMI: Non-instrumental vaginal birth for selected females giving birth for the first time",2402,7705,15614,33315,31.174561972999999,46.867777277999998,0.56849918889999995,45.753518866999997,47.982035688000003,45.162279710999996,48.573274843999997]
["2018 and 2019","Queensland","Private",27185,27629,"NCMI_1500","NCMI: Females having their second birth vaginally whose first birth was by caesarean section",265,4942,1517,12538,5.3622015377999999,12.099218376,0.46389923420000001,11.189975877,13.008460875000001,10.707520674,13.490916079]

{"sheet":"Graphics1","index":8,"n_rows":25,"n_cols":7,"rows_kept":25,"cut":false,"hidden":true,"merged":[]}
[]
[]
[]
[]
[]
[null,null,null,null,null,null,{"$f":"Status_panel!B16","v":""}]
[]
[]
[]
[]
[]
[]
[]
[]
[null,null,null,null,null,null,{"$f":"Status_panel!B14","v":""}]
[]
[]
[]
[]
[]
[]
[]
[]
[]
[null,null,null,null,null,null,{"$f":"Status_panel!B15","v":""}]