{"text_format":"1","workbook":"xlsx","n_sheets":9,"sheets":["Dashboard","Specifications","Status_panel","funnelPivot","getfunneldata","barPivot","Data","Funnel_practice","Graphics1"],"not_rendered":{"charts":4,"images":5,"macros":1,"external_links":1,"defined_names":31,"comments":0,"pivot_tables":3},"unopened":[{"sheet":"Funnel_practice","index":7,"reason":"not_a_worksheet"}],"bounds":{"document_bytes":16777216,"sheet_cells":100000,"rows_first":2000,"rows_last":500,"rows_between":2000,"halvings":0,"cell_chars":16384,"cell_head_chars":4096},"cells_cut":0,"cells_raw":0,"read":"whole","date_system":"1900"}

{"sheet":"Dashboard","index":0,"n_rows":23,"n_cols":19,"rows_kept":23,"cut":false,"hidden":false,"merged":[[5,13,7,16],[10,13,12,16]]}
[null,"Selected National Core Maternity Indicators"]
[null,{"$f":"Status_panel!B23","v":"Caesarean section for selected females giving birth for the first time"}]
[null,{"$f":"Status_panel!B24","v":"Peer group level 6 public acute hospitals, Queensland, 2018 and 2019"}]
[null,null,null,null,null,null,null,null,null,null,null,null,null,null,null,null,null,null,{"$f":"funnelPivot!B2","v":"Level 6"}]
[]
[null,null,null,null,null,null,null,null,null,null,null,null,null,{"$f":"numerator","v":"The number of selected females giving birth for the first time who gave birth by caesarean section."}]
[]
[]
[]
[null,null,null,null,null,null,"Funnel plot for Peer group 1"]
[null,null,null,null,null,null,null,null,null,null,null,null,null,{"$f":"VLOOKUP(funnelPivot!B3, getfunneldata!L2:N8, 3, FALSE)","v":"All selected females."}]
[]
[]
[]
[]
[]
[]
[]
[null,null,null,null,null,null,null,null,null,null,null,null,null,null," Numerator "," Denominator","Proportion (%)"]
[null,null,null,null,null,null,null,null,null,null,null,null,null,"Gold Coast University Hospital",769,3208,23.971321696]
{"$rows_left_out":4}
{"sheet":"Specifications","index":1,"n_rows":52,"n_cols":10,"rows_kept":52,"cut":false,"hidden":false,"merged":[]}
[]
[null,"Indicator specifications"]
[]
[]
[null,"Data source"]
[]
[null,"Queensland Perinatal Data Collection, Statistical Services Branch, Queensland Department of Health"]
[null,"Extracted on: ",null,"2022-05-17"]
[]
[null,"Notes"]
[]
[null,"Funnel plots present treatment estimates (e.g. rate of induction)  for each facility against the relevant number of mothers overall at the facility (e.g. all women, selected primigravida)."]
[null,"Control limits (95% and 99.7%)  represent the upper and lower bounds of normal variation around the overall peer group rate."]
[null,"Indicator results that are based on denominator<5, numerator=0 or numerator=denominator (i.e. rate of 100%) are not presented."]
[null,"Facility/peer group is based on the facility of birth."]
[null,"Peer group determined based on Clinical Services Capability Framework."]
[null,"Some hospitals changed peer group level over the time period:"]
[null,"Redland changed from CSCF level 3 to level 4 on June 1, 2016."]
[null,"Beaudesert changed from CSCF level 1 to level 3 on June 1, 2016."]
[null,"Chinchilla changed from CSCF level 1 to level 2 on November 1, 2014."]
{"$rows_left_out":33}
{"sheet":"Status_panel","index":2,"n_rows":35,"n_cols":13,"rows_kept":35,"cut":false,"hidden":true,"merged":[]}
["Perr selected:",{"$f":"funnelPivot!B2","v":"Level 6"}]
["More than 1 peer selected:",{"$f":"OR($B$1 = \"(All)\", $B$1 = \"(Multiple Items)\")","v":false}]
[]
["indicator selected:",{"$f":"IF(OR(funnelPivot!B3=\"(All)\", funnelPivot!B3=\"(Multiple Items)\"),\"\", MID(funnelPivot!B3,FIND(\":\",funnelPivot!B3,1)+2,100))","v":"Caesarean section for selected females giving birth for the first time"}]
["More than 1 indicator selected:",{"$f":"OR($B$4 = \"\", $B$4 = \"(Multiple Items)\")","v":false}]
[]
["numerator",{"$f":"VLOOKUP(funnelPivot!B3,getfunneldata!L2:N8,2,FALSE)","v":"The number of selected females giving birth for the first time who gave birth by caesarean section."}]
["title numerator",{"$f":"MID(numerator,FIND(\" of \",numerator)+4,M8)","v":"selected females giving birth for the first time who gave birth by caesarean section"},null,null,null,null,null,null,null,null,{"$f":"FIND(\".\",numerator)","v":99},{"$f":"FIND(\" of \",numerator)+4","v":15},{"$f":"K8-L8","v":84}]
[]
["years selected",{"$f":"funnelPivot!B1","v":"2018 and 2019"}]
["More than 1 biennium selected:",{"$f":"OR($B$10 = \"(All)\", $B$10 = \"(Multiple Items)\")","v":false}]
[]
["Show blocking screen 1:",{"$f":"OR($B$2, $B$5, $B$11)","v":false}]
["Blocking screen text 1:",{"$f":"IF($B$2,\"Select a single peer group\",\"\")","v":""}]
["Blocking screen text 2:",{"$f":"IF($B$5,\"Select a single indicator\",\"\")","v":""}]
["Blocking screen text 3:",{"$f":"IF($B$11,\"Select a single biennium\",\"\")","v":""}]
[]
["peer group:",{"$f":"IF(OR(B2,B11),\"Error in selection\", IF(B1=\"Queensland\",\", by peer group, Queensland, \"&years,\", \"&LOWER(B1)&\" public acute hospitals, Queensland, \"&years))","v":", level 6 public acute hospitals, Queensland, 2018 and 2019"}]
[]
["funnel title",{"$f":"\"Proportion of \"&title_num&$B$18","v":"Proportion of selected females giving birth for the first time who gave birth by caesarean section, level 6 public acute hospitals, Queensland, 2018 and 2019"}]
{"$rows_left_out":16}
{"sheet":"funnelPivot","index":3,"n_rows":9,"n_cols":8,"rows_kept":9,"cut":false,"hidden":true,"merged":[]}
["Biennium","2018 and 2019"]
["Peer group","Level 6"]
["Indicator Name","NCMI: Caesarean section for selected females giving birth for the first time"]
[]
["Row Labels","Sum of Denominator","Sum of Fac rate","Sum of Qld rate","Sum of lcl95","Sum of lcl99.7","Sum of ucl95","Sum of ucl99.7"]
["Townsville",1232,27.922077922,26.456593948999998,23.993451361000002,22.686477744000001,28.919736536999999,30.226710154999999]
["Royal Brisbane and Women's",2988,30.020080320999998,26.456593948999998,24.874964981000002,24.035733283999999,28.038222916999999,28.877454614000001]
["Gold Coast University Hospital",3208,23.971321696,26.456593948999998,24.930161016,24.120217011000001,27.983026882000001,28.792970886999999]
["Mater Mothers' Hospital",3711,25.249258959999999,26.456593948999998,25.037374906,24.284319903,27.875812993,28.628867995]

{"sheet":"getfunneldata","index":4,"n_rows":56,"n_cols":14,"rows_kept":56,"cut":false,"hidden":true,"merged":[]}
["Region","Facility denominator","Facility","Peer group","95% CI","99.7% CI","UCL95","UCL99.7",null,null,null,"Numerator and Denominator description"]
[{"$f":"IF(funnelPivot!A6<>0,funnelPivot!A6,NA())","v":"Townsville"},{"$f":"IF(funnelPivot!B6<>0,funnelPivot!B6,NA())","v":1232},{"$f":"IF(funnelPivot!C6<>0,funnelPivot!C6,NA())","v":27.922077922},{"$f":"IF(funnelPivot!D6<>0,funnelPivot!D6,NA())","v":26.456593948999998},{"$f":"IF(funnelPivot!E6<>0,funnelPivot!E6,NA())","v":23.993451361000002},{"$f":"IF(funnelPivot!F6<>0,funnelPivot!F6,NA())","v":22.686477744000001},{"$f":"IF(funnelPivot!G6<>0,funnelPivot!G6,NA())","v":28.919736536999999},{"$f":"IF(funnelPivot!H6<>0,funnelPivot!H6,NA())","v":30.226710154999999},null,null,null,"Indicator category","Numerator description","Denominator description"]
[{"$f":"IF(funnelPivot!A7<>0,funnelPivot!A7,NA())","v":"Royal Brisbane and Women's"},{"$f":"IF(funnelPivot!B7<>0,funnelPivot!B7,NA())","v":2988},{"$f":"IF(funnelPivot!C7<>0,funnelPivot!C7,NA())","v":30.020080320999998},{"$f":"IF(funnelPivot!D7<>0,funnelPivot!D7,NA())","v":26.456593948999998},{"$f":"IF(funnelPivot!E7<>0,funnelPivot!E7,NA())","v":24.874964981000002},{"$f":"IF(funnelPivot!F7<>0,funnelPivot!F7,NA())","v":24.035733283999999},{"$f":"IF(funnelPivot!G7<>0,funnelPivot!G7,NA())","v":28.038222916999999},{"$f":"IF(funnelPivot!H7<>0,funnelPivot!H7,NA())","v":28.877454614000001},null,null,null,"Modified NCMI: Caesarean section for all females giving birth","The number of females who gave birth by caesarean section.","All females who gave birth."]
[{"$f":"IF(funnelPivot!A8<>0,funnelPivot!A8,NA())","v":"Gold Coast University Hospital"},{"$f":"IF(funnelPivot!B8<>0,funnelPivot!B8,NA())","v":3208},{"$f":"IF(funnelPivot!C8<>0,funnelPivot!C8,NA())","v":23.971321696},{"$f":"IF(funnelPivot!D8<>0,funnelPivot!D8,NA())","v":26.456593948999998},{"$f":"IF(funnelPivot!E8<>0,funnelPivot!E8,NA())","v":24.930161016},{"$f":"IF(funnelPivot!F8<>0,funnelPivot!F8,NA())","v":24.120217011000001},{"$f":"IF(funnelPivot!G8<>0,funnelPivot!G8,NA())","v":27.983026882000001},{"$f":"IF(funnelPivot!H8<>0,funnelPivot!H8,NA())","v":28.792970886999999},null,null,null,"NCMI: Induction of labour for selected females giving birth for the first time","The number of selected females who gave birth for the first time and who had labour induced.","All selected females."]
[{"$f":"IF(funnelPivot!A7<>0,funnelPivot!A7,NA())","v":"Royal Brisbane and Women's"},{"$f":"IF(funnelPivot!B7<>0,funnelPivot!B7,NA())","v":2988},{"$f":"IF(funnelPivot!C7<>0,funnelPivot!C7,NA())","v":30.020080320999998},{"$f":"IF(funnelPivot!D7<>0,funnelPivot!D7,NA())","v":26.456593948999998},{"$f":"IF(funnelPivot!E7<>0,funnelPivot!E7,NA())","v":24.874964981000002},{"$f":"IF(funnelPivot!F7<>0,funnelPivot!F7,NA())","v":24.035733283999999},{"$f":"IF(funnelPivot!G7<>0,funnelPivot!G7,NA())","v":28.038222916999999},{"$f":"IF(funnelPivot!H7<>0,funnelPivot!H7,NA())","v":28.877454614000001},null,null,null,"Modified NCMI: Induction of labour for all females giving birth","The number of females who had labour induced.","All females who gave birth."]
[{"$f":"IF(funnelPivot!A8<>0,funnelPivot!A8,NA())","v":"Gold Coast University Hospital"},{"$f":"IF(funnelPivot!B8<>0,funnelPivot!B8,NA())","v":3208},{"$f":"IF(funnelPivot!C8<>0,funnelPivot!C8,NA())","v":23.971321696},{"$f":"IF(funnelPivot!D8<>0,funnelPivot!D8,NA())","v":26.456593948999998},{"$f":"IF(funnelPivot!E8<>0,funnelPivot!E8,NA())","v":24.930161016},{"$f":"IF(funnelPivot!F8<>0,funnelPivot!F8,NA())","v":24.120217011000001},{"$f":"IF(funnelPivot!G8<>0,funnelPivot!G8,NA())","v":27.983026882000001},{"$f":"IF(funnelPivot!H8<>0,funnelPivot!H8,NA())","v":28.792970886999999},null,null,null,"NCMI: Caesarean section for selected females giving birth for the first time","The number of selected females giving birth for the first time who gave birth by caesarean section.","All selected females."]
[{"$f":"IF(funnelPivot!A9<>0,funnelPivot!A9,NA())","v":"Mater Mothers' Hospital"},{"$f":"IF(funnelPivot!B9<>0,funnelPivot!B9,NA())","v":3711},{"$f":"IF(funnelPivot!C9<>0,funnelPivot!C9,NA())","v":25.249258959999999},{"$f":"IF(funnelPivot!D9<>0,funnelPivot!D9,NA())","v":26.456593948999998},{"$f":"IF(funnelPivot!E9<>0,funnelPivot!E9,NA())","v":25.037374906},{"$f":"IF(funnelPivot!F9<>0,funnelPivot!F9,NA())","v":24.284319903},{"$f":"IF(funnelPivot!G9<>0,funnelPivot!G9,NA())","v":27.875812993},{"$f":"IF(funnelPivot!H9<>0,funnelPivot!H9,NA())","v":28.628867995},null,null,null,"NCMI: Non-instrumental vaginal birth for selected females giving birth for the first time","The number of selected females giving birth for the first time who gave birth by non-instrumental vaginal birth.","All selected females."]
[{"$f":"IF(funnelPivot!A10<>0,funnelPivot!A10,NA())","v":{"$error":"#N/A"}},{"$f":"IF(funnelPivot!B10<>0,funnelPivot!B10,NA())","v":{"$error":"#N/A"}},{"$f":"IF(funnelPivot!C10<>0,funnelPivot!C10,NA())","v":{"$error":"#N/A"}},{"$f":"IF(funnelPivot!D10<>0,funnelPivot!D10,NA())","v":{"$error":"#N/A"}},{"$f":"IF(funnelPivot!E10<>0,funnelPivot!E10,NA())","v":{"$error":"#N/A"}},{"$f":"IF(funnelPivot!F10<>0,funnelPivot!F10,NA())","v":{"$error":"#N/A"}},{"$f":"IF(funnelPivot!G10<>0,funnelPivot!G10,NA())","v":{"$error":"#N/A"}},{"$f":"IF(funnelPivot!H10<>0,funnelPivot!H10,NA())","v":{"$error":"#N/A"}},null,null,null,"NCMI: Females having their second birth vaginally whose first birth was by caesarean section","The number of females having their second birth vaginally whose first birth was by caesarean section.","The number of females having their second birth whose first birth was by caesarean section."]
[{"$f":"IF(funnelPivot!A11<>0,funnelPivot!A11,NA())","v":{"$error":"#N/A"}},{"$f":"IF(funnelPivot!B11<>0,funnelPivot!B11,NA())","v":{"$error":"#N/A"}},{"$f":"IF(funnelPivot!C11<>0,funnelPivot!C11,NA())","v":{"$error":"#N/A"}},{"$f":"IF(funnelPivot!D11<>0,funnelPivot!D11,NA())","v":{"$error":"#N/A"}},{"$f":"IF(funnelPivot!E11<>0,funnelPivot!E11,NA())","v":{"$error":"#N/A"}},{"$f":"IF(funnelPivot!F11<>0,funnelPivot!F11,NA())","v":{"$error":"#N/A"}},{"$f":"IF(funnelPivot!G11<>0,funnelPivot!G11,NA())","v":{"$error":"#N/A"}},{"$f":"IF(funnelPivot!H11<>0,funnelPivot!H11,NA())","v":{"$error":"#N/A"}}]
[{"$f":"IF(funnelPivot!A14<>0,funnelPivot!A14,NA())","v":{"$error":"#N/A"}},{"$f":"IF(funnelPivot!B14<>0,funnelPivot!B14,NA())","v":{"$error":"#N/A"}},{"$f":"IF(funnelPivot!C14<>0,funnelPivot!C14,NA())","v":{"$error":"#N/A"}},{"$f":"IF(funnelPivot!D14<>0,funnelPivot!D14,NA())","v":{"$error":"#N/A"}},{"$f":"IF(funnelPivot!E14<>0,funnelPivot!E14,NA())","v":{"$error":"#N/A"}},{"$f":"IF(funnelPivot!F14<>0,funnelPivot!F14,NA())","v":{"$error":"#N/A"}},{"$f":"IF(funnelPivot!G14<>0,funnelPivot!G14,NA())","v":{"$error":"#N/A"}},{"$f":"IF(funnelPivot!H14<>0,funnelPivot!H14,NA())","v":{"$error":"#N/A"}}]
[{"$f":"IF(funnelPivot!A12<>0,funnelPivot!A12,NA())","v":{"$error":"#N/A"}},{"$f":"IF(funnelPivot!B12<>0,funnelPivot!B12,NA())","v":{"$error":"#N/A"}},{"$f":"IF(funnelPivot!C12<>0,funnelPivot!C12,NA())","v":{"$error":"#N/A"}},{"$f":"IF(funnelPivot!D12<>0,funnelPivot!D12,NA())","v":{"$error":"#N/A"}},{"$f":"IF(funnelPivot!E12<>0,funnelPivot!E12,NA())","v":{"$error":"#N/A"}},{"$f":"IF(funnelPivot!F12<>0,funnelPivot!F12,NA())","v":{"$error":"#N/A"}},{"$f":"IF(funnelPivot!G12<>0,funnelPivot!G12,NA())","v":{"$error":"#N/A"}},{"$f":"IF(funnelPivot!H12<>0,funnelPivot!H12,NA())","v":{"$error":"#N/A"}}]
[{"$f":"IF(funnelPivot!A13<>0,funnelPivot!A13,NA())","v":{"$error":"#N/A"}},{"$f":"IF(funnelPivot!B13<>0,funnelPivot!B13,NA())","v":{"$error":"#N/A"}},{"$f":"IF(funnelPivot!C13<>0,funnelPivot!C13,NA())","v":{"$error":"#N/A"}},{"$f":"IF(funnelPivot!D13<>0,funnelPivot!D13,NA())","v":{"$error":"#N/A"}},{"$f":"IF(funnelPivot!E13<>0,funnelPivot!E13,NA())","v":{"$error":"#N/A"}},{"$f":"IF(funnelPivot!F13<>0,funnelPivot!F13,NA())","v":{"$error":"#N/A"}},{"$f":"IF(funnelPivot!G13<>0,funnelPivot!G13,NA())","v":{"$error":"#N/A"}},{"$f":"IF(funnelPivot!H13<>0,funnelPivot!H13,NA())","v":{"$error":"#N/A"}}]
[{"$f":"IF(funnelPivot!A14<>0,funnelPivot!A14,NA())","v":{"$error":"#N/A"}},{"$f":"IF(funnelPivot!B14<>0,funnelPivot!B14,NA())","v":{"$error":"#N/A"}},{"$f":"IF(funnelPivot!C14<>0,funnelPivot!C14,NA())","v":{"$error":"#N/A"}},{"$f":"IF(funnelPivot!D14<>0,funnelPivot!D14,NA())","v":{"$error":"#N/A"}},{"$f":"IF(funnelPivot!E14<>0,funnelPivot!E14,NA())","v":{"$error":"#N/A"}},{"$f":"IF(funnelPivot!F14<>0,funnelPivot!F14,NA())","v":{"$error":"#N/A"}},{"$f":"IF(funnelPivot!G14<>0,funnelPivot!G14,NA())","v":{"$error":"#N/A"}},{"$f":"IF(funnelPivot!H14<>0,funnelPivot!H14,NA())","v":{"$error":"#N/A"}}]
[{"$f":"IF(funnelPivot!A15<>0,funnelPivot!A15,NA())","v":{"$error":"#N/A"}},{"$f":"IF(funnelPivot!B15<>0,funnelPivot!B15,NA())","v":{"$error":"#N/A"}},{"$f":"IF(funnelPivot!C15<>0,funnelPivot!C15,NA())","v":{"$error":"#N/A"}},{"$f":"IF(funnelPivot!D15<>0,funnelPivot!D15,NA())","v":{"$error":"#N/A"}},{"$f":"IF(funnelPivot!E15<>0,funnelPivot!E15,NA())","v":{"$error":"#N/A"}},{"$f":"IF(funnelPivot!F15<>0,funnelPivot!F15,NA())","v":{"$error":"#N/A"}},{"$f":"IF(funnelPivot!G15<>0,funnelPivot!G15,NA())","v":{"$error":"#N/A"}},{"$f":"IF(funnelPivot!H15<>0,funnelPivot!H15,NA())","v":{"$error":"#N/A"}}]
[{"$f":"IF(funnelPivot!A16<>0,funnelPivot!A16,NA())","v":{"$error":"#N/A"}},{"$f":"IF(funnelPivot!B16<>0,funnelPivot!B16,NA())","v":{"$error":"#N/A"}},{"$f":"IF(funnelPivot!C16<>0,funnelPivot!C16,NA())","v":{"$error":"#N/A"}},{"$f":"IF(funnelPivot!D16<>0,funnelPivot!D16,NA())","v":{"$error":"#N/A"}},{"$f":"IF(funnelPivot!E16<>0,funnelPivot!E16,NA())","v":{"$error":"#N/A"}},{"$f":"IF(funnelPivot!F16<>0,funnelPivot!F16,NA())","v":{"$error":"#N/A"}},{"$f":"IF(funnelPivot!G16<>0,funnelPivot!G16,NA())","v":{"$error":"#N/A"}},{"$f":"IF(funnelPivot!H16<>0,funnelPivot!H16,NA())","v":{"$error":"#N/A"}}]
[{"$f":"IF(funnelPivot!A17<>0,funnelPivot!A17,NA())","v":{"$error":"#N/A"}},{"$f":"IF(funnelPivot!B17<>0,funnelPivot!B17,NA())","v":{"$error":"#N/A"}},{"$f":"IF(funnelPivot!C17<>0,funnelPivot!C17,NA())","v":{"$error":"#N/A"}},{"$f":"IF(funnelPivot!D17<>0,funnelPivot!D17,NA())","v":{"$error":"#N/A"}},{"$f":"IF(funnelPivot!E17<>0,funnelPivot!E17,NA())","v":{"$error":"#N/A"}},{"$f":"IF(funnelPivot!F17<>0,funnelPivot!F17,NA())","v":{"$error":"#N/A"}},{"$f":"IF(funnelPivot!G17<>0,funnelPivot!G17,NA())","v":{"$error":"#N/A"}},{"$f":"IF(funnelPivot!H17<>0,funnelPivot!H17,NA())","v":{"$error":"#N/A"}}]
[{"$f":"IF(funnelPivot!A18<>0,funnelPivot!A18,NA())","v":{"$error":"#N/A"}},{"$f":"IF(funnelPivot!B18<>0,funnelPivot!B18,NA())","v":{"$error":"#N/A"}},{"$f":"IF(funnelPivot!C18<>0,funnelPivot!C18,NA())","v":{"$error":"#N/A"}},{"$f":"IF(funnelPivot!D18<>0,funnelPivot!D18,NA())","v":{"$error":"#N/A"}},{"$f":"IF(funnelPivot!E18<>0,funnelPivot!E18,NA())","v":{"$error":"#N/A"}},{"$f":"IF(funnelPivot!F18<>0,funnelPivot!F18,NA())","v":{"$error":"#N/A"}},{"$f":"IF(funnelPivot!G18<>0,funnelPivot!G18,NA())","v":{"$error":"#N/A"}},{"$f":"IF(funnelPivot!H18<>0,funnelPivot!H18,NA())","v":{"$error":"#N/A"}}]
[{"$f":"IF(funnelPivot!A19<>0,funnelPivot!A19,NA())","v":{"$error":"#N/A"}},{"$f":"IF(funnelPivot!B19<>0,funnelPivot!B19,NA())","v":{"$error":"#N/A"}},{"$f":"IF(funnelPivot!C19<>0,funnelPivot!C19,NA())","v":{"$error":"#N/A"}},{"$f":"IF(funnelPivot!D19<>0,funnelPivot!D19,NA())","v":{"$error":"#N/A"}},{"$f":"IF(funnelPivot!E19<>0,funnelPivot!E19,NA())","v":{"$error":"#N/A"}},{"$f":"IF(funnelPivot!F19<>0,funnelPivot!F19,NA())","v":{"$error":"#N/A"}},{"$f":"IF(funnelPivot!G19<>0,funnelPivot!G19,NA())","v":{"$error":"#N/A"}},{"$f":"IF(funnelPivot!H19<>0,funnelPivot!H19,NA())","v":{"$error":"#N/A"}}]
[{"$f":"IF(funnelPivot!A20<>0,funnelPivot!A20,NA())","v":{"$error":"#N/A"}},{"$f":"IF(funnelPivot!B20<>0,funnelPivot!B20,NA())","v":{"$error":"#N/A"}},{"$f":"IF(funnelPivot!C20<>0,funnelPivot!C20,NA())","v":{"$error":"#N/A"}},{"$f":"IF(funnelPivot!D20<>0,funnelPivot!D20,NA())","v":{"$error":"#N/A"}},{"$f":"IF(funnelPivot!E20<>0,funnelPivot!E20,NA())","v":{"$error":"#N/A"}},{"$f":"IF(funnelPivot!F20<>0,funnelPivot!F20,NA())","v":{"$error":"#N/A"}},{"$f":"IF(funnelPivot!G20<>0,funnelPivot!G20,NA())","v":{"$error":"#N/A"}},{"$f":"IF(funnelPivot!H20<>0,funnelPivot!H20,NA())","v":{"$error":"#N/A"}}]
[{"$f":"IF(funnelPivot!A21<>0,funnelPivot!A21,NA())","v":{"$error":"#N/A"}},{"$f":"IF(funnelPivot!B21<>0,funnelPivot!B21,NA())","v":{"$error":"#N/A"}},{"$f":"IF(funnelPivot!C21<>0,funnelPivot!C21,NA())","v":{"$error":"#N/A"}},{"$f":"IF(funnelPivot!D21<>0,funnelPivot!D21,NA())","v":{"$error":"#N/A"}},{"$f":"IF(funnelPivot!E21<>0,funnelPivot!E21,NA())","v":{"$error":"#N/A"}},{"$f":"IF(funnelPivot!F21<>0,funnelPivot!F21,NA())","v":{"$error":"#N/A"}},{"$f":"IF(funnelPivot!G21<>0,funnelPivot!G21,NA())","v":{"$error":"#N/A"}},{"$f":"IF(funnelPivot!H21<>0,funnelPivot!H21,NA())","v":{"$error":"#N/A"}}]
{"$rows_left_out":37}
{"sheet":"barPivot","index":5,"n_rows":11,"n_cols":3,"rows_kept":11,"cut":false,"hidden":true,"merged":[]}
[]
[null,"Biennium","2018 and 2019"]
[null,"Peer group","Level 6"]
[null,"Indicator Name","NCMI: Caesarean section for selected females giving birth for the first time"]
[]
[null,"Row Labels","Sum of Fac rate"]
[null,"Gold Coast University Hospital",23.971321696]
[null,"Mater Mothers' Hospital",25.249258959999999]
[null,"Royal Brisbane and Women's",30.020080320999998]
[null,"Townsville",27.922077922]
[null,"Grand Total",107.16273889899999]

{"sheet":"Data","index":6,"n_rows":774,"n_cols":18,"rows_kept":774,"cut":false,"hidden":true,"merged":[]}
["Biennium","Peer group","Facility/Region","Mothers","Babies","Indicator Code","Indicator Name","Numerator","Denominator","Qld Numerator","Qld Denominator","Fac rate","Qld rate","Stardard Error","lcl95","ucl95","lcl99.7","ucl99.7"]
["2014 and 2015","Level 2/3 (300+ births)","Atherton",397,399,"NCMI_0500","NCMI: Induction of labour for selected females giving birth for the first time",23,92,799,3000,25,26.633333332999999,4.6085917976999999,17.600493409999999,35.666173256999997,12.807557940000001,40.459108725999997]
["2014 and 2015","Level 2/3 (300+ births)","Atherton",397,399,"NCMI_0500_A","Modified NCMI: Induction of labour for all females giving birth",66,397,2331,11401,16.624685139,20.445574950000001,2.0241215154000001,16.478296779000001,24.412853120000001,14.373210403,26.517939496]
["2014 and 2015","Level 2/3 (300+ births)","Atherton",397,399,"NCMI_0600","NCMI: Caesarean section for selected females giving birth for the first time",22,92,718,3000,23.913043477999999,23.933333333,4.4484106699000003,15.21444842,32.652218245999997,10.588101324,37.278565342999997]
["2014 and 2015","Level 2/3 (300+ births)","Atherton",397,399,"NCMI_0600_A","Modified NCMI: Caesarean section for all females giving birth",120,397,3108,11401,30.226700252000001,27.260766599,2.2349002221999998,22.880362164000001,31.641171034999999,20.556065932999999,33.965467265999997]
["2014 and 2015","Level 2/3 (300+ births)","Atherton",397,399,"NCMI_0700","NCMI: Non-instrumental vaginal birth for selected females giving birth for the first time",56,92,1807,3000,60.869565217000002,60.233333332999997,5.1025131157999999,50.232407625999997,70.234259039999998,44.925793986000002,75.540872680999996]
["2014 and 2015","Level 2/3 (300+ births)","Atherton",397,399,"NCMI_1500","NCMI: Females having their second birth vaginally whose first birth was by caesarean section",3,41,139,932,7.3170731706999996,14.914163090000001,5.5633470544000003,4.0100028635999996,25.818323317000001,-1.7758780729999999,31.604204252999999]
["2014 and 2015","Level 2/3 (300+ births)","Dalby",434,434,"NCMI_0500","NCMI: Induction of labour for selected females giving birth for the first time",33,100,799,3000,33,26.633333332999999,4.4204059643000004,17.969337642999999,35.297329023000003,13.372115441,39.894551225999997]
["2014 and 2015","Level 2/3 (300+ births)","Dalby",434,434,"NCMI_0500_A","Modified NCMI: Induction of labour for all females giving birth",88,434,2331,11401,20.276497696,20.445574950000001,1.9359180534,16.651175564999999,24.239974333999999,14.637820788999999,26.253329109999999]
["2014 and 2015","Level 2/3 (300+ births)","Dalby",434,434,"NCMI_0600","NCMI: Caesarean section for selected females giving birth for the first time",24,100,718,3000,24,23.933333333,4.2667656238999996,15.570472711000001,32.296193956000003,11.133036462,36.733630204999997]
["2014 and 2015","Level 2/3 (300+ births)","Dalby",434,434,"NCMI_0600_A","Modified NCMI: Caesarean section for all females giving birth",123,434,3108,11401,28.341013825000001,27.260766599,2.1375118315999999,23.071243409000001,31.450289788999999,20.848231105,33.673302094]
["2014 and 2015","Level 2/3 (300+ births)","Dalby",434,434,"NCMI_0700","NCMI: Non-instrumental vaginal birth for selected females giving birth for the first time",63,100,1807,3000,63,60.233333332999997,4.8941586496999996,50.640782379999997,69.825884286999994,45.550857383999997,74.915809283000002]
["2014 and 2015","Level 2/3 (300+ births)","Dalby",434,434,"NCMI_1500","NCMI: Females having their second birth vaginally whose first birth was by caesarean section",2,35,139,932,5.7142857142999999,14.914163090000001,6.0213525967999999,3.1123120003999998,26.716014179999998,-3.1498946999999999,32.978220880999999]
["2014 and 2015","Level 2/3 (300+ births)","Emerald",647,648,"NCMI_0500","NCMI: Induction of labour for selected females giving birth for the first time",56,189,799,3000,29.62962963,26.633333332999999,3.2153722117000001,20.331203798000001,32.935462868000002,16.987216698000001,36.279449968000002]
["2014 and 2015","Level 2/3 (300+ births)","Emerald",647,648,"NCMI_0500_A","Modified NCMI: Induction of labour for all females giving birth",142,647,2331,11401,21.947449767999998,20.445574950000001,1.5855490957,17.337898721999998,23.553251177,15.688927661999999,25.202222237000001]
["2014 and 2015","Level 2/3 (300+ births)","Emerald",647,648,"NCMI_0600","NCMI: Caesarean section for selected females giving birth for the first time",35,189,718,3000,18.518518519000001,23.933333333,3.1036153085999998,17.850247328999998,30.016419337999999,14.622487408,33.244179258999999]
["2014 and 2015","Level 2/3 (300+ births)","Emerald",647,648,"NCMI_0600_A","Modified NCMI: Caesarean section for all females giving birth",140,647,3108,11401,21.638330756999999,27.260766599,1.7506577541999999,23.829477400999998,30.692055797999998,22.008793337,32.512739861999997]
["2014 and 2015","Level 2/3 (300+ births)","Emerald",647,648,"NCMI_0700","NCMI: Non-instrumental vaginal birth for selected females giving birth for the first time",133,189,1807,3000,70.370370370000003,60.233333332999997,3.5599765834000001,53.255779230000002,67.210887436999997,49.553403582999998,70.913263083999993]
["2014 and 2015","Level 2/3 (300+ births)","Emerald",647,648,"NCMI_1500","NCMI: Females having their second birth vaginally whose first birth was by caesarean section",10,45,139,932,22.222222221999999,14.914163090000001,5.3103338425000004,4.5059087589000004,25.322417421000001,-1.0168384370000001,30.845164617999998]
["2014 and 2015","Level 2/3 (300+ births)","Gladstone",1089,1095,"NCMI_0500","NCMI: Induction of labour for selected females giving birth for the first time",54,331,799,3000,16.314199395999999,26.633333332999999,2.4296748560000001,21.871170616000001,31.395496050999999,19.344308765000001,33.922357900999998]
{"$rows_left_out":755}
{"sheet":"Graphics1","index":8,"n_rows":25,"n_cols":7,"rows_kept":25,"cut":false,"hidden":true,"merged":[]}
[]
[]
[]
[]
[]
[null,null,null,null,null,null,{"$f":"Status_panel!B16","v":""}]
[]
[]
[]
[]
[]
[]
[]
[]
[null,null,null,null,null,null,{"$f":"Status_panel!B14","v":""}]
[]
[]
[]
[]
[]
{"$rows_left_out":5}